{"text_format":"1","workbook":"xlsx","n_sheets":3,"sheets":["Planilla","Piso mín.","Índice RIPTE"],"not_rendered":{"charts":0,"images":2,"macros":1,"external_links":1,"defined_names":12,"comments":1,"pivot_tables":0},"unopened":[],"bounds":{"document_bytes":16777216,"sheet_cells":100000,"rows_first":2000,"rows_last":500,"rows_between":2000,"halvings":0,"cell_chars":16384,"cell_head_chars":4096},"cells_cut":0,"cells_raw":0,"read":"whole","date_system":"1900"}

{"sheet":"Planilla","index":0,"n_rows":311,"n_cols":14,"rows_kept":311,"cut":false,"hidden":false,"merged":[[13,16339,13,16340],[13,16355,13,16356],[13,16371,13,16372],[13,16259,13,16260],[13,16275,13,16276],[13,16291,13,16292],[13,16307,13,16308],[13,16323,13,16324],[13,16179,13,16180],[13,16195,13,16196],[13,16211,13,16212],[13,16227,13,16228],[13,16243,13,16244],[13,16099,13,16100],[13,16115,13,16116],[13,16131,13,16132],[13,16147,13,16148],[13,16163,13,16164],[13,16019,13,16020],[13,16035,13,16036],[13,16051,13,16052],[13,16067,13,16068],[13,16083,13,16084],[13,15939,13,15940],[13,15955,13,15956],[13,15971,13,15972],[13,15987,13,15988],[13,16003,13,16004],[13,15859,13,15860],[13,15875,13,15876],[13,15891,13,15892],[13,15907,13,15908],[13,15923,13,15924],[13,15779,13,15780],[13,15795,13,15796],[13,15811,13,15812],[13,15827,13,15828],[13,15843,13,15844],[13,15699,13,15700],[13,15715,13,15716],[13,15731,13,15732],[13,15747,13,15748],[13,15763,13,15764],[13,15619,13,15620],[13,15635,13,15636],[13,15651,13,15652],[13,15667,13,15668],[13,15683,13,15684],[13,15539,13,15540],[13,15555,13,15556],[13,15571,13,15572],[13,15587,13,15588],[13,15603,13,15604],[13,15459,13,15460],[13,15475,13,15476],[13,15491,13,15492],[13,15507,13,15508],[13,15523,13,15524],[13,15379,13,15380],[13,15395,13,15396],[13,15411,13,15412],[13,15427,13,15428],[13,15443,13,15444],[13,15299,13,15300],[13,15315,13,15316],[13,15331,13,15332],[13,15347,13,15348],[13,15363,13,15364],[13,15219,13,15220],[13,15235,13,15236],[13,15251,13,15252],[13,15267,13,15268],[13,15283,13,15284],[13,15139,13,15140],[13,15155,13,15156],[13,15171,13,15172],[13,15187,13,15188],[13,15203,13,15204],[13,15059,13,15060],[13,15075,13,15076],[13,15091,13,15092],[13,15107,13,15108],[13,15123,13,15124],[13,14979,13,14980],[13,14995,13,14996],[13,15011,13,15012],[13,15027,13,15028],[13,15043,13,15044],[13,14899,13,14900],[13,14915,13,14916],[13,14931,13,14932],[13,14947,13,14948],[13,14963,13,14964],[13,14819,13,14820],[13,14835,13,14836],[13,14851,13,14852],[13,14867,13,14868],[13,14883,13,14884],[13,14739,13,14740],[13,14755,13,14756],[13,14771,13,14772],[13,14787,13,14788],[13,14803,13,14804],[13,14659,13,14660],[13,14675,13,14676],[13,14691,13,14692],[13,14707,13,14708],[13,14723,13,14724],[13,14579,13,14580],[13,14595,13,14596],[13,14611,13,14612],[13,14627,13,14628],[13,14643,13,14644],[13,14499,13,14500],[13,14515,13,14516],[13,14531,13,14532],[13,14547,13,14548],[13,14563,13,14564],[13,14419,13,14420],[13,14435,13,14436],[13,14451,13,14452],[13,14467,13,14468],[13,14483,13,14484],[13,14339,13,14340],[13,14355,13,14356],[13,14371,13,14372],[13,14387,13,14388],[13,14403,13,14404],[13,14259,13,14260],[13,14275,13,14276],[13,14291,13,14292],[13,14307,13,14308],[13,14323,13,14324],[13,14179,13,14180],[13,14195,13,14196],[13,14211,13,14212],[13,14227,13,14228],[13,14243,13,14244],[13,14099,13,14100],[13,14115,13,14116],[13,14131,13,14132],[13,14147,13,14148],[13,14163,13,14164],[13,14019,13,14020],[13,14035,13,14036],[13,14051,13,14052],[13,14067,13,14068],[13,14083,13,14084],[13,13939,13,13940],[13,13955,13,13956],[13,13971,13,13972],[13,13987,13,13988],[13,14003,13,14004],[13,13859,13,13860],[13,13875,13,13876],[13,13891,13,13892],[13,13907,13,13908],[13,13923,13,13924],[13,13779,13,13780],[13,13795,13,13796],[13,13811,13,13812],[13,13827,13,13828],[13,13843,13,13844],[13,13699,13,13700],[13,13715,13,13716],[13,13731,13,13732],[13,13747,13,13748],[13,13763,13,13764],[13,13619,13,13620],[13,13635,13,13636],[13,13651,13,13652],[13,13667,13,13668],[13,13683,13,13684],[13,13539,13,13540],[13,13555,13,13556],[13,13571,13,13572],[13,13587,13,13588],[13,13603,13,13604],[13,13459,13,13460],[13,13475,13,13476],[13,13491,13,13492],[13,13507,13,13508],[13,13523,13,13524],[13,13379,13,13380],[13,13395,13,13396],[13,13411,13,13412],[13,13427,13,13428],[13,13443,13,13444],[13,13299,13,13300],[13,13315,13,13316],[13,13331,13,13332],[13,13347,13,13348],[13,13363,13,13364],[13,13219,13,13220],[13,13235,13,13236],[13,13251,13,13252],[13,13267,13,13268],[13,13283,13,13284],[13,13139,13,13140],[13,13155,13,13156],[13,13171,13,13172],[13,13187,13,13188],[13,13203,13,13204],[13,13059,13,13060],[13,13075,13,13076],[13,13091,13,13092],[13,13107,13,13108],[13,13123,13,13124],[13,12979,13,12980],[13,12995,13,12996],[13,13011,13,13012],[13,13027,13,13028],[13,13043,13,13044],[13,12899,13,12900],[13,12915,13,12916],[13,12931,13,12932],[13,12947,13,12948],[13,12963,13,12964],[13,12819,13,12820],[13,12835,13,12836],[13,12851,13,12852],[13,12867,13,12868],[13,12883,13,12884],[13,12739,13,12740],[13,12755,13,12756],[13,12771,13,12772],[13,12787,13,12788],[13,12803,13,12804],[13,12659,13,12660],[13,12675,13,12676],[13,12691,13,12692],[13,12707,13,12708],[13,12723,13,12724],[13,12579,13,12580],[13,12595,13,12596],[13,12611,13,12612],[13,12627,13,12628],[13,12643,13,12644],[13,12499,13,12500],[13,12515,13,12516],[13,12531,13,12532],[13,12547,13,12548],[13,12563,13,12564],[13,12419,13,12420],[13,12435,13,12436],[13,12451,13,12452],[13,12467,13,12468],[13,12483,13,12484],[13,12339,13,12340],[13,12355,13,12356],[13,12371,13,12372],[13,12387,13,12388],[13,12403,13,12404],[13,12259,13,12260],[13,12275,13,12276],[13,12291,13,12292],[13,12307,13,12308],[13,12323,13,12324],[13,12179,13,12180],[13,12195,13,12196],[13,12211,13,12212],[13,12227,13,12228],[13,12243,13,12244],[13,12099,13,12100],[13,12115,13,12116],[13,12131,13,12132],[13,12147,13,12148],[13,12163,13,12164],[13,12019,13,12020],[13,12035,13,12036],[13,12051,13,12052],[13,12067,13,12068],[13,12083,13,12084],[13,11939,13,11940],[13,11955,13,11956],[13,11971,13,11972],[13,11987,13,11988],[13,12003,13,12004],[13,11859,13,11860],[13,11875,13,11876],[13,11891,13,11892],[13,11907,13,11908],[13,11923,13,11924],[13,11779,13,11780],[13,11795,13,11796],[13,11811,13,11812],[13,11827,13,11828],[13,11843,13,11844],[13,11699,13,11700],[13,11715,13,11716],[13,11731,13,11732],[13,11747,13,11748],[13,11763,13,11764],[13,11619,13,11620],[13,11635,13,11636],[13,11651,13,11652],[13,11667,13,11668],[13,11683,13,11684],[13,11539,13,11540],[13,11555,13,11556],[13,11571,13,11572],[13,11587,13,11588],[13,11603,13,11604],[13,11459,13,11460],[13,11475,13,11476],[13,11491,13,11492],[13,11507,13,11508],[13,11523,13,11524],[13,11379,13,11380],[13,11395,13,11396],[13,11411,13,11412],[13,11427,13,11428],[13,11443,13,11444],[13,11299,13,11300],[13,11315,13,11316],[13,11331,13,11332],[13,11347,13,11348],[13,11363,13,11364],[13,11219,13,11220],[13,11235,13,11236],[13,11251,13,11252],[13,11267,13,11268],[13,11283,13,11284],[13,11139,13,11140],[13,11155,13,11156],[13,11171,13,11172],[13,11187,13,11188],[13,11203,13,11204],[13,11059,13,11060],[13,11075,13,11076],[13,11091,13,11092],[13,11107,13,11108],[13,11123,13,11124],[13,10979,13,10980],[13,10995,13,10996],[13,11011,13,11012],[13,11027,13,11028],[13,11043,13,11044],[13,10899,13,10900],[13,10915,13,10916],[13,10931,13,10932],[13,10947,13,10948],[13,10963,13,10964],[13,10819,13,10820],[13,10835,13,10836],[13,10851,13,10852],[13,10867,13,10868],[13,10883,13,10884],[13,10739,13,10740],[13,10755,13,10756],[13,10771,13,10772],[13,10787,13,10788],[13,10803,13,10804],[13,10659,13,10660],[13,10675,13,10676],[13,10691,13,10692],[13,10707,13,10708],[13,10723,13,10724],[13,10579,13,10580],[13,10595,13,10596],[13,10611,13,10612],[13,10627,13,10628],[13,10643,13,10644],[13,10499,13,10500],[13,10515,13,10516],[13,10531,13,10532],[13,10547,13,10548],[13,10563,13,10564],[13,10419,13,10420],[13,10435,13,10436],[13,10451,13,10452],[13,10467,13,10468],[13,10483,13,10484],[13,10339,13,10340],[13,10355,13,10356],[13,10371,13,10372],[13,10387,13,10388],[13,10403,13,10404],[13,10259,13,10260],[13,10275,13,10276],[13,10291,13,10292],[13,10307,13,10308],[13,10323,13,10324],[13,10179,13,10180],[13,10195,13,10196],[13,10211,13,10212],[13,10227,13,10228],[13,10243,13,10244],[13,10099,13,10100],[13,10115,13,10116],[13,10131,13,10132],[13,10147,13,10148],[13,10163,13,10164],[13,10019,13,10020],[13,10035,13,10036],[13,10051,13,10052],[13,10067,13,10068],[13,10083,13,10084],[13,9939,13,9940],[13,9955,13,9956],[13,9971,13,9972],[13,9987,13,9988],[13,10003,13,10004],[13,9859,13,9860],[13,9875,13,9876],[13,9891,13,9892],[13,9907,13,9908],[13,9923,13,9924],[13,9779,13,9780],[13,9795,13,9796],[13,9811,13,9812],[13,9827,13,9828],[13,9843,13,9844],[13,9699,13,9700],[13,9715,13,9716],[13,9731,13,9732],[13,9747,13,9748],[13,9763,13,9764],[13,9619,13,9620],[13,9635,13,9636],[13,9651,13,9652],[13,9667,13,9668],[13,9683,13,9684],[13,9539,13,9540],[13,9555,13,9556],[13,9571,13,9572],[13,9587,13,9588],[13,9603,13,9604],[13,9459,13,9460],[13,9475,13,9476],[13,9491,13,9492],[13,9507,13,9508],[13,9523,13,9524],[13,9379,13,9380],[13,9395,13,9396],[13,9411,13,9412],[13,9427,13,9428],[13,9443,13,9444],[13,9299,13,9300],[13,9315,13,9316],[13,9331,13,9332],[13,9347,13,9348],[13,9363,13,9364],[13,9219,13,9220],[13,9235,13,9236],[13,9251,13,9252],[13,9267,13,9268],[13,9283,13,9284],[13,9139,13,9140],[13,9155,13,9156],[13,9171,13,9172],[13,9187,13,9188],[13,9203,13,9204],[13,9059,13,9060],[13,9075,13,9076],[13,9091,13,9092],[13,9107,13,9108],[13,9123,13,9124],[13,8979,13,8980],[13,8995,13,8996],[13,9011,13,9012],[13,9027,13,9028],[13,9043,13,9044],[13,8899,13,8900],[13,8915,13,8916],[13,8931,13,8932],[13,8947,13,8948],[13,8963,13,8964],[13,8819,13,8820],[13,8835,13,8836],[13,8851,13,8852],[13,8867,13,8868],[13,8883,13,8884],[13,8739,13,8740],[13,8755,13,8756],[13,8771,13,8772],[13,8787,13,8788],[13,8803,13,8804],[13,8659,13,8660],[13,8675,13,8676],[13,8691,13,8692],[13,8707,13,8708],[13,8723,13,8724],[13,8579,13,8580],[13,8595,13,8596],[13,8611,13,8612],[13,8627,13,8628],[13,8643,13,8644],[13,8499,13,8500],[13,8515,13,8516],[13,8531,13,8532],[13,8547,13,8548],[13,8563,13,8564],[13,8419,13,8420],[13,8435,13,8436],[13,8451,13,8452],[13,8467,13,8468],[13,8483,13,8484],[13,8339,13,8340],[13,8355,13,8356],[13,8371,13,8372],[13,8387,13,8388],[13,8403,13,8404],[13,8259,13,8260],[13,8275,13,8276],[13,8291,13,8292],[13,8307,13,8308],[13,8323,13,8324],[13,8179,13,8180],[13,8195,13,8196],[13,8211,13,8212],[13,8227,13,8228],[13,8243,13,8244],[13,8099,13,8100],[13,8115,13,8116],[13,8131,13,8132],[13,8147,13,8148],[13,8163,13,8164],[13,8019,13,8020],[13,8035,13,8036],[13,8051,13,8052],[13,8067,13,8068],[13,8083,13,8084],[13,7939,13,7940],[13,7955,13,7956],[13,7971,13,7972],[13,7987,13,7988],[13,8003,13,8004],[13,7859,13,7860],[13,7875,13,7876],[13,7891,13,7892],[13,7907,13,7908],[13,7923,13,7924],[13,7779,13,7780],[13,7795,13,7796],[13,7811,13,7812],[13,7827,13,7828],[13,7843,13,7844],[13,7699,13,7700],[13,7715,13,7716],[13,7731,13,7732],[13,7747,13,7748],[13,7763,13,7764],[13,7619,13,7620],[13,7635,13,7636],[13,7651,13,7652],[13,7667,13,7668],[13,7683,13,7684],[13,7539,13,7540],[13,7555,13,7556],[13,7571,13,7572],[13,7587,13,7588],[13,7603,13,7604],[13,7459,13,7460],[13,7475,13,7476],[13,7491,13,7492],[13,7507,13,7508],[13,7523,13,7524],[13,7379,13,7380],[13,7395,13,7396],[13,7411,13,7412],[13,7427,13,7428],[13,7443,13,7444],[13,7299,13,7300],[13,7315,13,7316],[13,7331,13,7332],[13,7347,13,7348],[13,7363,13,7364],[13,7219,13,7220],[13,7235,13,7236],[13,7251,13,7252],[13,7267,13,7268],[13,7283,13,7284],[13,7139,13,7140],[13,7155,13,7156],[13,7171,13,7172],[13,7187,13,7188],[13,7203,13,7204],[13,7059,13,7060],[13,7075,13,7076],[13,7091,13,7092],[13,7107,13,7108],[13,7123,13,7124],[13,6979,13,6980],[13,6995,13,6996],[13,7011,13,7012],[13,7027,13,7028],[13,7043,13,7044],[13,6899,13,6900],[13,6915,13,6916],[13,6931,13,6932],[13,6947,13,6948],[13,6963,13,6964],[13,6819,13,6820],[13,6835,13,6836],[13,6851,13,6852],[13,6867,13,6868],[13,6883,13,6884],[13,6739,13,6740],[13,6755,13,6756],[13,6771,13,6772],[13,6787,13,6788],[13,6803,13,6804],[13,6659,13,6660],[13,6675,13,6676],[13,6691,13,6692],[13,6707,13,6708],[13,6723,13,6724],[13,6579,13,6580],[13,6595,13,6596],[13,6611,13,6612],[13,6627,13,6628],[13,6643,13,6644],[13,6499,13,6500],[13,6515,13,6516],[13,6531,13,6532],[13,6547,13,6548],[13,6563,13,6564],[13,6419,13,6420],[13,6435,13,6436],[13,6451,13,6452],[13,6467,13,6468],[13,6483,13,6484],[13,6339,13,6340],[13,6355,13,6356],[13,6371,13,6372],[13,6387,13,6388],[13,6403,13,6404],[13,6259,13,6260],[13,6275,13,6276],[13,6291,13,6292],[13,6307,13,6308],[13,6323,13,6324],[13,6179,13,6180],[13,6195,13,6196],[13,6211,13,6212],[13,6227,13,6228],[13,6243,13,6244],[13,6099,13,6100],[13,6115,13,6116],[13,6131,13,6132],[13,6147,13,6148],[13,6163,13,6164],[13,6019,13,6020],[13,6035,13,6036],[13,6051,13,6052],[13,6067,13,6068],[13,6083,13,6084],[13,5939,13,5940],[13,5955,13,5956],[13,5971,13,5972],[13,5987,13,5988],[13,6003,13,6004],[13,5859,13,5860],[13,5875,13,5876],[13,5891,13,5892],[13,5907,13,5908],[13,5923,13,5924],[13,5779,13,5780],[13,5795,13,5796],[13,5811,13,5812],[13,5827,13,5828],[13,5843,13,5844],[13,5699,13,5700],[13,5715,13,5716],[13,5731,13,5732],[13,5747,13,5748],[13,5763,13,5764],[13,5619,13,5620],[13,5635,13,5636],[13,5651,13,5652],[13,5667,13,5668],[13,5683,13,5684],[13,5539,13,5540],[13,5555,13,5556],[13,5571,13,5572],[13,5587,13,5588],[13,5603,13,5604],[13,5459,13,5460],[13,5475,13,5476],[13,5491,13,5492],[13,5507,13,5508],[13,5523,13,5524],[13,5379,13,5380],[13,5395,13,5396],[13,5411,13,5412],[13,5427,13,5428],[13,5443,13,5444],[13,5299,13,5300],[13,5315,13,5316],[13,5331,13,5332],[13,5347,13,5348],[13,5363,13,5364],[13,5219,13,5220],[13,5235,13,5236],[13,5251,13,5252],[13,5267,13,5268],[13,5283,13,5284],[13,5139,13,5140],[13,5155,13,5156],[13,5171,13,5172],[13,5187,13,5188],[13,5203,13,5204],[13,5059,13,5060],[13,5075,13,5076],[13,5091,13,5092],[13,5107,13,5108],[13,5123,13,5124],[13,4979,13,4980],[13,4995,13,4996],[13,5011,13,5012],[13,5027,13,5028],[13,5043,13,5044],[13,4899,13,4900],[13,4915,13,4916],[13,4931,13,4932],[13,4947,13,4948],[13,4963,13,4964],[13,4819,13,4820],[13,4835,13,4836],[13,4851,13,4852],[13,4867,13,4868],[13,4883,13,4884],[13,4739,13,4740],[13,4755,13,4756],[13,4771,13,4772],[13,4787,13,4788],[13,4803,13,4804],[13,4659,13,4660],[13,4675,13,4676],[13,4691,13,4692],[13,4707,13,4708],[13,4723,13,4724],[13,4579,13,4580],[13,4595,13,4596],[13,4611,13,4612],[13,4627,13,4628],[13,4643,13,4644],[13,4499,13,4500],[13,4515,13,4516],[13,4531,13,4532],[13,4547,13,4548],[13,4563,13,4564],[13,4419,13,4420],[13,4435,13,4436],[13,4451,13,4452],[13,4467,13,4468],[13,4483,13,4484],[13,4339,13,4340],[13,4355,13,4356],[13,4371,13,4372],[13,4387,13,4388],[13,4403,13,4404],[13,4259,13,4260],[13,4275,13,4276],[13,4291,13,4292],[13,4307,13,4308],[13,4323,13,4324],[13,4179,13,4180],[13,4195,13,4196],[13,4211,13,4212],[13,4227,13,4228],[13,4243,13,4244],[13,4099,13,4100],[13,4115,13,4116],[13,4131,13,4132],[13,4147,13,4148],[13,4163,13,4164],[13,4019,13,4020],[13,4035,13,4036],[13,4051,13,4052],[13,4067,13,4068],[13,4083,13,4084],[13,3939,13,3940],[13,3955,13,3956],[13,3971,13,3972],[13,3987,13,3988],[13,4003,13,4004],[13,3859,13,3860],[13,3875,13,3876],[13,3891,13,3892],[13,3907,13,3908],[13,3923,13,3924],[13,3779,13,3780],[13,3795,13,3796],[13,3811,13,3812],[13,3827,13,3828],[13,3843,13,3844],[13,3699,13,3700],[13,3715,13,3716],[13,3731,13,3732],[13,3747,13,3748],[13,3763,13,3764],[13,3619,13,3620],[13,3635,13,3636],[13,3651,13,3652],[13,3667,13,3668],[13,3683,13,3684],[13,3539,13,3540],[13,3555,13,3556],[13,3571,13,3572],[13,3587,13,3588],[13,3603,13,3604],[13,3459,13,3460],[13,3475,13,3476],[13,3491,13,3492],[13,3507,13,3508],[13,3523,13,3524],[13,3379,13,3380],[13,3395,13,3396],[13,3411,13,3412],[13,3427,13,3428],[13,3443,13,3444],[13,3299,13,3300],[13,3315,13,3316],[13,3331,13,3332],[13,3347,13,3348],[13,3363,13,3364],[13,3219,13,3220],[13,3235,13,3236],[13,3251,13,3252],[13,3267,13,3268],[13,3283,13,3284],[13,3139,13,3140],[13,3155,13,3156],[13,3171,13,3172],[13,3187,13,3188],[13,3203,13,3204],[13,3059,13,3060],[13,3075,13,3076],[13,3091,13,3092],[13,3107,13,3108],[13,3123,13,3124],[13,2979,13,2980],[13,2995,13,2996],[13,3011,13,3012],[13,3027,13,3028],[13,3043,13,3044],[13,2899,13,2900],[13,2915,13,2916],[13,2931,13,2932],[13,2947,13,2948],[13,2963,13,2964],[13,2819,13,2820],[13,2835,13,2836],[13,2851,13,2852],[13,2867,13,2868],[13,2883,13,2884],[13,2739,13,2740],[13,2755,13,2756],[13,2771,13,2772],[13,2787,13,2788],[13,2803,13,2804],[13,2659,13,2660],[13,2675,13,2676],[13,2691,13,2692],[13,2707,13,2708],[13,2723,13,2724],[13,2579,13,2580],[13,2595,13,2596],[13,2611,13,2612],[13,2627,13,2628],[13,2643,13,2644],[13,2499,13,2500],[13,2515,13,2516],[13,2531,13,2532],[13,2547,13,2548],[13,2563,13,2564],[13,2419,13,2420],[13,2435,13,2436],[13,2451,13,2452],[13,2467,13,2468],[13,2483,13,2484],[13,2339,13,2340],[13,2355,13,2356],[13,2371,13,2372],[13,2387,13,2388],[13,2403,13,2404],[13,2259,13,2260],[13,2275,13,2276],[13,2291,13,2292],[13,2307,13,2308],[13,2323,13,2324],[13,2179,13,2180],[13,2195,13,2196],[13,2211,13,2212],[13,2227,13,2228],[13,2243,13,2244],[13,2099,13,2100],[13,2115,13,2116],[13,2131,13,2132],[13,2147,13,2148],[13,2163,13,2164],[13,2019,13,2020],[13,2035,13,2036],[13,2051,13,2052],[13,2067,13,2068],[13,2083,13,2084],[13,1939,13,1940],[13,1955,13,1956],[13,1971,13,1972],[13,1987,13,1988],[13,2003,13,2004],[13,1859,13,1860],[13,1875,13,1876],[13,1891,13,1892],[13,1907,13,1908],[13,1923,13,1924],[13,1779,13,1780],[13,1795,13,1796],[13,1811,13,1812],[13,1827,13,1828],[13,1843,13,1844],[13,1699,13,1700],[13,1715,13,1716],[13,1731,13,1732],[13,1747,13,1748],[13,1763,13,1764],[13,1619,13,1620],[13,1635,13,1636],[13,1651,13,1652],[13,1667,13,1668],[13,1683,13,1684],[13,1539,13,1540],[13,1555,13,1556],[13,1571,13,1572],[13,1587,13,1588],[13,1603,13,1604],[13,1459,13,1460],[13,1475,13,1476],[13,1491,13,1492],[13,1507,13,1508],[13,1523,13,1524],[13,1379,13,1380],[13,1395,13,1396],[13,1411,13,1412],[13,1427,13,1428],[13,1443,13,1444],[13,1299,13,1300],[13,1315,13,1316],[13,1331,13,1332],[13,1347,13,1348],[13,1363,13,1364],[13,1219,13,1220],[13,1235,13,1236],[13,1251,13,1252],[13,1267,13,1268],[13,1283,13,1284],[13,1139,13,1140],[13,1155,13,1156],[13,1171,13,1172],[13,1187,13,1188],[13,1203,13,1204],[13,1059,13,1060],[13,1075,13,1076],[13,1091,13,1092],[13,1107,13,1108],[13,1123,13,1124],[13,979,13,980],[13,995,13,996],[13,1011,13,1012],[13,1027,13,1028],[13,1043,13,1044],[13,899,13,900],[13,915,13,916],[13,931,13,932],[13,947,13,948],[13,963,13,964],[13,819,13,820],[13,835,13,836],[13,851,13,852],[13,867,13,868],[13,883,13,884],[13,739,13,740],[13,755,13,756],[13,771,13,772],[13,787,13,788],[13,803,13,804],[13,659,13,660],[13,675,13,676],[13,691,13,692],[13,707,13,708],[13,723,13,724],[13,579,13,580],[13,595,13,596],[13,611,13,612],[13,627,13,628],[13,643,13,644],[13,499,13,500],[13,515,13,516],[13,531,13,532],[13,547,13,548],[13,563,13,564],[13,419,13,420],[13,435,13,436],[13,451,13,452],[13,467,13,468],[13,483,13,484],[14,3,14,8],[13,339,13,340]],"merged_total":1063,"flags":["merged_cut"]}
[]
[null,null,null,"Autos:","introducir carátula aquí",null,null,"N° de expediente:","introducir n°\nde sac aquí",null,null,null,"Planilla de cálculo versión:","V.10 - 20/03/2026"]
[null,null,null,"Datos iniciales:"]
[]
[null,null,null,"Fecha de nacimiento:",null,null,{"$f":"IF(F5=\"\",\"*falta cargar fecha de nacimiento\",\"\")","v":"*falta cargar fecha de nacimiento"},"% de capacidad restante",1]
[null,null,null,"Fecha de ingreso (opcional):",null,null,null,"% de incapacidad a indemnizar",null,null,{"$f":"IF(I6=\"\",\"*falta cargar % de incapacidad\",\"\")","v":"*falta cargar % de incapacidad"}]
[null,null,null,"Fecha PMI:",null,null,{"$f":"IF(F7=\"\",\"*falta cargar fecha de PMI\",\"\")","v":"*falta cargar fecha de PMI"},"% de incapacidad con preexistencias",{"$f":"IF(I6=\"\",\"\",ROUND(I6*I5,4))","v":""}]
[null,null,null,"Fecha de fin relación \nlaboral (opcional):",null,null,null,"Edad a la fecha \nde PMI",{"$f":"IF(OR(F5=\"\",F7=\"\")=TRUE,\"\",(DATEDIF(F5,F7,\"Y\")))","v":""}]
[null,null,null,"Fecha liquidación:",null,null,{"$f":"IF(F9=\"\",\"*falta cargar fecha de liquidación\",\"\")","v":"*falta cargar fecha de liquidación"},"Coeficiente etario",{"$f":"IFERROR(ROUND(65/I8,3),\"\")","v":""}]
[null,null,null,"Valor Ingreso base (VIB)  \nart. 12 Inc. 1 (ex IBM)",null,{"$f":"IFERROR(ROUND(I38/E38*30.4,2),\"\")","v":""},{"$f":"IF(F10=\"\",\"*falta cargar Valor ingreso base\",\"\")","v":"*falta cargar Valor ingreso base"},"% del año trabajado",{"$f":"IFERROR(ROUND(E38/(DATEDIF((DATE(YEAR(F13)-1,MONTH(F13),DAY(F13))),F13,\"d\")),4),\"\")","v":""}]
[null,null,null,"Accidente in itinere",null,null,{"$f":"IF(F11=\"\",\"*falta consignar si es accidente in itinere\",\"\")","v":"*falta consignar si es accidente in itinere"},"Tasa de Intereses RIPTE",{"$f":"IF(F9=\"\",\"\",SUM(Tabla2[Tasa de interés computable]))","v":""},null,{"$f":"IF(I11=\"\",\"*falta cargar fecha de liquidación\",\"\")","v":"*falta cargar fecha de liquidación"}]
[null,null,null,"Fecha computo haberes (desde)",null,{"$f":"MAX(DATE(YEAR(F13)-1,MONTH(F13),DAY(F13)),F6-1)","v":"3798-12-31"},{"$f":"IFERROR(VLOOKUP(DATE(YEAR(F7),MONTH(F7),1),Tabla1[#All],4,FALSE),\"falta cargar fecha de PMI\")","v":"falta cargar fecha de PMI"}]
[null,null,null,"Fecha computo haberes (hasta)",null,{"$f":"MIN(F7,F8)","v":"00:00:00"}]
[null,null,null,"Fallecimiento del Damnificado",null,"NO"]
[null,null,null,"LIQUIDACIÓN DE INDEMNIZACIONES LRT"]
[]
[null,null,null,"Valores de fórmula LRT y tasa de interés"]
[]
[null,null,null,"Valor Ingreso base (VIB)  art. 12 Inc. 1 (ex IBM)",null,null,{"$f":"IF(VIB=\"\",\"falta cargar valor ingreso base\",F10)","v":"falta cargar valor ingreso base"},"Forma de cálculo: promedio mensual de salarios devengados por el/la trabajador/a durante el año anterior a la PMI (o el tiempo de prestación de servicio si fuera menor), actualizado mes a mes aplicándose la variación del índice RIPTE."]
[null,null,null,"Tasa de Intereses RIPTE",null,null,{"$f":"IF(F9=\"\",\"falta carcar fecha de liquidación\",I11)","v":"falta carcar fecha de liquidación"},"Forma de cálculo: sumatoria de las variaciones mensuales del índice RIPTE en el período considerado conforme al fallo \"Romero\"."]
[null,null,null,"Valor ingreso base (VIB) + Total Intereses RIPTE",null,null,{"$f":"IFERROR(ROUND(F10+F10*I11,2),\"falta cargar VIB o fecha de liquidación\")","v":"falta cargar VIB o fecha de liquidación"},"Forma de cálculo: valor ingreso base (VIB) más total interés RIPTE."]
[null,null,null,"Indemnización a valor histórico",null,null,{"$f":"IFERROR(ROUND(IF(porc_incap_con_preex.>0.66,53*VIB*coef_etario,53*VIB*coef_etario*porc_incap_con_preex.),2),\"falta cargar % de incap.\")","v":"falta cargar % de incap."},"Forma de cálculo: 53 multiplicado por el VIB,  multiplicado por el % de incapacidad correspondiente, multiplicado  por el coeficiente etario."]
[null,null,null,"Indemnización + interés ",null,null,{"$f":"IFERROR(ROUND(IF(porc_incap_con_preex.>0.66,53*VIB*coef_etario*(1+Tasa_RIPTE),53*VIB*coef_etario*porc_incap_con_preex.*(1+Tasa_RIPTE)),2),\"falta cargar % de incap. o fecha de liquidación\")","v":"falta cargar % de incap. o fecha de liquidación"},"Forma de cálculo: 53 multiplicado por el VIB más interés devengado, multiplicado por el % de incapacidad correspondiente, multiplicado  por el coeficiente etario. "]
[]
[null,null,null,"Comparación con piso mínimo"]
[]
[null,null,null,{"$f":"\"Indemnización: Piso mínimo histórico al \" & DAY(F7) & \"/\" & MONTH(F7) & \"/\" &YEAR(F7)","v":"Indemnización: Piso mínimo histórico al 0/1/1900"},null,null,{"$f":"IFERROR(ROUND(VLOOKUP(F7,Tabla3[#All],2,FALSE)*I7,2),\"falta cargar fecha de PMI y/o % de incap.\")","v":"falta cargar fecha de PMI y/o % de incap."},{"$f":"IFERROR(\"Forma de cálculo: piso mínimo a la fecha de la PMI ($\"& VLOOKUP(F7,Tabla3[#All],2,FALSE) &\") según \" & VLOOKUP(F7,Tabla3[#All],7,FALSE)  & \" multiplicado por el % de incapacidad correspondiente.\",\"\")","v":""}]
[null,null,null,"Indemnización: Piso mínimo + intereses a la fecha de liquidación",null,null,{"$f":"IFERROR(ROUND(G27+G27*I11,2),\"falta cargar fechas de referencia y/o porcen. de incap.\")","v":"falta cargar fechas de referencia y/o porcen. de incap."},"Forma de cálculo: piso mínimo a la fecha de la PMI, multiplicado por el % de incapacidad correspondiente, multiplicado por la tasa de interés RIPTE en el período considerado conforme al fallo \"Romero\""]
[]
[null,null,null,"Liquidación final"]
[]
[null,null,null,"Valor computable",null,null,{"$f":"MAX(G28,G23)","v":0},"Forma de cálculo: mayor valor entre indemnización (fórmula) y piso mínimo."]
[null,null,null,"Compensación adicional de pago único (CAPU) - art. 11 inc. 4",null,null,{"$f":"IFERROR((IF(F14=\"SI\",VLOOKUP(F7,'Piso mín.'!C:H,5,FALSE),(IF(I7+(1-I5)>=0.66,VLOOKUP(F7,'Piso mín.'!C:H,4,FALSE),(IF(I7+(1-I5)>0.5,VLOOKUP(F7,'Piso mín.'!C:H,3,FALSE),0))))))*(1+I11),\"falta cargar fecha de referencia o % de incap.\")","v":"falta cargar fecha de referencia o % de incap."},"Forma de cálculo: valores correspondientes al art 11 inc. 4  más  intereses RIPTE tomando la sumatoria de las variaciones mensuales del índice RIPTE en el período considerado conforme al fallo \"Romero\"."]
[null,null,null,"Art. 3° Ley 26773 ",null,null,{"$f":"IF(F11=\"SI\",\"no aplica\",IFERROR(ROUND((G32+G33)*0.2,2),\"falta cargar fecha de referencia o % de incap.\"))","v":"falta cargar fecha de referencia o % de incap."},"Forma de cálculo: 20% de la liquidación aplicable, sus intereses y la CAPU en caso de corresponder."]
[]
[null,null,null,{"$f":"\"TOTAL INDEMNIZACIÓN POR INCAPACIDAD ACTUALIZADA AL \" & DAY(F9) & \"/\" & MONTH(F9) & \"/\" &YEAR(F9)","v":"TOTAL INDEMNIZACIÓN POR INCAPACIDAD ACTUALIZADA AL 0/1/1900"},null,null,{"$f":"IF(F11=\"SI\",G32+G33,IFERROR(G32+G34+G33,\"falta cargar fecha de referencia o % de incap.\"))","v":"falta cargar fecha de referencia o % de incap."}]
[]
[null,null,null,null,{"$f":"SUM(Tabla1[Días \ntrabajados])","v":0},{"$f":"SUM(Tabla1[Haberes \nmensuales])","v":0},null,{"$f":"SUM(Tabla1[Haberes Actualizados])","v":0},{"$f":"SUM(Tabla1[Haberes computables])","v":0}]
[]
[null,null,null,"Detalle de cálculo del Valor del Ingreso Base (VIB) - art. 12 inc. 1 LRT"]
[]
[null,null,null,"Mes Haberes","Días \ntrabajados","Haberes \nmensuales","Índice \nRIPTE","Haberes Actualizados","Haberes computables"]
[null,null,null,"2016-01-01",{"$f":"IFERROR((DATEDIF($F$12,MIN(EOMONTH(Tabla1[[#This Row],[Mes Haberes]],0),$F$13),\"d\")),0)","v":0},null,1808.6,{"$f":"IFERROR(ROUND(Tabla1[[#This Row],[Haberes \nmensuales]]/Tabla1[[#This Row],[Índice \nRIPTE]]*$G$12,2),0)","v":0},{"$f":"ROUND(Tabla1[[#This Row],[Haberes Actualizados]]/DAY(EOMONTH(Tabla1[[#This Row],[Mes Haberes]],0))*Tabla1[[#This Row],[Días \ntrabajados]],2)","v":0}]
[null,null,null,"2016-02-01",{"$f":"IFERROR((DATEDIF($F$12,MIN(EOMONTH(Tabla1[[#This Row],[Mes Haberes]],0),$F$13),\"d\")),0)-SUM($E$43:E43)","v":0},null,1888.34,{"$f":"IFERROR(ROUND(Tabla1[[#This Row],[Haberes \nmensuales]]/Tabla1[[#This Row],[Índice \nRIPTE]]*$G$12,2),0)","v":0},{"$f":"ROUND(Tabla1[[#This Row],[Haberes Actualizados]]/DAY(EOMONTH(Tabla1[[#This Row],[Mes Haberes]],0))*Tabla1[[#This Row],[Días \ntrabajados]],2)","v":0}]
[null,null,null,"2016-03-01",{"$f":"IFERROR((DATEDIF($F$12,MIN(EOMONTH(Tabla1[[#This Row],[Mes Haberes]],0),$F$13),\"d\")),0)-SUM($E$43:E44)","v":0},null,1940.55,{"$f":"IFERROR(ROUND(Tabla1[[#This Row],[Haberes \nmensuales]]/Tabla1[[#This Row],[Índice \nRIPTE]]*$G$12,2),0)","v":0},{"$f":"ROUND(Tabla1[[#This Row],[Haberes Actualizados]]/DAY(EOMONTH(Tabla1[[#This Row],[Mes Haberes]],0))*Tabla1[[#This Row],[Días \ntrabajados]],2)","v":0}]
[null,null,null,"2016-04-01",{"$f":"IFERROR((DATEDIF($F$12,MIN(EOMONTH(Tabla1[[#This Row],[Mes Haberes]],0),$F$13),\"d\")),0)-SUM($E$43:E45)","v":0},null,2022.16,{"$f":"IFERROR(ROUND(Tabla1[[#This Row],[Haberes \nmensuales]]/Tabla1[[#This Row],[Índice \nRIPTE]]*$G$12,2),0)","v":0},{"$f":"ROUND(Tabla1[[#This Row],[Haberes Actualizados]]/DAY(EOMONTH(Tabla1[[#This Row],[Mes Haberes]],0))*Tabla1[[#This Row],[Días \ntrabajados]],2)","v":0}]
[null,null,null,"2016-05-01",{"$f":"IFERROR((DATEDIF($F$12,MIN(EOMONTH(Tabla1[[#This Row],[Mes Haberes]],0),$F$13),\"d\")),0)-SUM($E$43:E46)","v":0},null,2062.33,{"$f":"IFERROR(ROUND(Tabla1[[#This Row],[Haberes \nmensuales]]/Tabla1[[#This Row],[Índice \nRIPTE]]*$G$12,2),0)","v":0},{"$f":"ROUND(Tabla1[[#This Row],[Haberes Actualizados]]/DAY(EOMONTH(Tabla1[[#This Row],[Mes Haberes]],0))*Tabla1[[#This Row],[Días \ntrabajados]],2)","v":0}]
[null,null,null,"2016-06-01",{"$f":"IFERROR((DATEDIF($F$12,MIN(EOMONTH(Tabla1[[#This Row],[Mes Haberes]],0),$F$13),\"d\")),0)-SUM($E$43:E47)","v":0},null,2089.1799999999998,{"$f":"IFERROR(ROUND(Tabla1[[#This Row],[Haberes \nmensuales]]/Tabla1[[#This Row],[Índice \nRIPTE]]*$G$12,2),0)","v":0},{"$f":"ROUND(Tabla1[[#This Row],[Haberes Actualizados]]/DAY(EOMONTH(Tabla1[[#This Row],[Mes Haberes]],0))*Tabla1[[#This Row],[Días \ntrabajados]],2)","v":0}]
[null,null,null,"2016-07-01",{"$f":"IFERROR((DATEDIF($F$12,MIN(EOMONTH(Tabla1[[#This Row],[Mes Haberes]],0),$F$13),\"d\")),0)-SUM($E$43:E48)","v":0},null,2170.4299999999998,{"$f":"IFERROR(ROUND(Tabla1[[#This Row],[Haberes \nmensuales]]/Tabla1[[#This Row],[Índice \nRIPTE]]*$G$12,2),0)","v":0},{"$f":"ROUND(Tabla1[[#This Row],[Haberes Actualizados]]/DAY(EOMONTH(Tabla1[[#This Row],[Mes Haberes]],0))*Tabla1[[#This Row],[Días \ntrabajados]],2)","v":0}]
[null,null,null,"2016-08-01",{"$f":"IFERROR((DATEDIF($F$12,MIN(EOMONTH(Tabla1[[#This Row],[Mes Haberes]],0),$F$13),\"d\")),0)-SUM($E$43:E49)","v":0},null,2196.5300000000002,{"$f":"IFERROR(ROUND(Tabla1[[#This Row],[Haberes \nmensuales]]/Tabla1[[#This Row],[Índice \nRIPTE]]*$G$12,2),0)","v":0},{"$f":"ROUND(Tabla1[[#This Row],[Haberes Actualizados]]/DAY(EOMONTH(Tabla1[[#This Row],[Mes Haberes]],0))*Tabla1[[#This Row],[Días \ntrabajados]],2)","v":0}]
[null,null,null,"2016-09-01",{"$f":"IFERROR((DATEDIF($F$12,MIN(EOMONTH(Tabla1[[#This Row],[Mes Haberes]],0),$F$13),\"d\")),0)-SUM($E$43:E50)","v":0},null,2247.9299999999998,{"$f":"IFERROR(ROUND(Tabla1[[#This Row],[Haberes \nmensuales]]/Tabla1[[#This Row],[Índice \nRIPTE]]*$G$12,2),0)","v":0},{"$f":"ROUND(Tabla1[[#This Row],[Haberes Actualizados]]/DAY(EOMONTH(Tabla1[[#This Row],[Mes Haberes]],0))*Tabla1[[#This Row],[Días \ntrabajados]],2)","v":0}]
[null,null,null,"2016-10-01",{"$f":"IFERROR((DATEDIF($F$12,MIN(EOMONTH(Tabla1[[#This Row],[Mes Haberes]],0),$F$13),\"d\")),0)-SUM($E$43:E51)","v":0},null,2293.9699999999998,{"$f":"IFERROR(ROUND(Tabla1[[#This Row],[Haberes \nmensuales]]/Tabla1[[#This Row],[Índice \nRIPTE]]*$G$12,2),0)","v":0},{"$f":"ROUND(Tabla1[[#This Row],[Haberes Actualizados]]/DAY(EOMONTH(Tabla1[[#This Row],[Mes Haberes]],0))*Tabla1[[#This Row],[Días \ntrabajados]],2)","v":0}]
[null,null,null,"2016-11-01",{"$f":"IFERROR((DATEDIF($F$12,MIN(EOMONTH(Tabla1[[#This Row],[Mes Haberes]],0),$F$13),\"d\")),0)-SUM($E$43:E52)","v":0},null,2334.36,{"$f":"IFERROR(ROUND(Tabla1[[#This Row],[Haberes \nmensuales]]/Tabla1[[#This Row],[Índice \nRIPTE]]*$G$12,2),0)","v":0},{"$f":"ROUND(Tabla1[[#This Row],[Haberes Actualizados]]/DAY(EOMONTH(Tabla1[[#This Row],[Mes Haberes]],0))*Tabla1[[#This Row],[Días \ntrabajados]],2)","v":0}]
[null,null,null,"2016-12-01",{"$f":"IFERROR((DATEDIF($F$12,MIN(EOMONTH(Tabla1[[#This Row],[Mes Haberes]],0),$F$13),\"d\")),0)-SUM($E$43:E53)","v":0},null,2364.94,{"$f":"IFERROR(ROUND(Tabla1[[#This Row],[Haberes \nmensuales]]/Tabla1[[#This Row],[Índice \nRIPTE]]*$G$12,2),0)","v":0},{"$f":"ROUND(Tabla1[[#This Row],[Haberes Actualizados]]/DAY(EOMONTH(Tabla1[[#This Row],[Mes Haberes]],0))*Tabla1[[#This Row],[Días \ntrabajados]],2)","v":0}]
[null,null,null,"2017-01-01",{"$f":"IFERROR((DATEDIF($F$12,MIN(EOMONTH(Tabla1[[#This Row],[Mes Haberes]],0),$F$13),\"d\")),0)-SUM($E$43:E54)","v":0},null,2405.87,{"$f":"IFERROR(ROUND(Tabla1[[#This Row],[Haberes \nmensuales]]/Tabla1[[#This Row],[Índice \nRIPTE]]*$G$12,2),0)","v":0},{"$f":"ROUND(Tabla1[[#This Row],[Haberes Actualizados]]/DAY(EOMONTH(Tabla1[[#This Row],[Mes Haberes]],0))*Tabla1[[#This Row],[Días \ntrabajados]],2)","v":0}]
[null,null,null,"2017-02-01",{"$f":"IFERROR((DATEDIF($F$12,MIN(EOMONTH(Tabla1[[#This Row],[Mes Haberes]],0),$F$13),\"d\")),0)-SUM($E$43:E55)","v":0},null,2455.5700000000002,{"$f":"IFERROR(ROUND(Tabla1[[#This Row],[Haberes \nmensuales]]/Tabla1[[#This Row],[Índice \nRIPTE]]*$G$12,2),0)","v":0},{"$f":"ROUND(Tabla1[[#This Row],[Haberes Actualizados]]/DAY(EOMONTH(Tabla1[[#This Row],[Mes Haberes]],0))*Tabla1[[#This Row],[Días \ntrabajados]],2)","v":0}]
[null,null,null,"2017-03-01",{"$f":"IFERROR((DATEDIF($F$12,MIN(EOMONTH(Tabla1[[#This Row],[Mes Haberes]],0),$F$13),\"d\")),0)-SUM($E$43:E56)","v":0},null,2547.29,{"$f":"IFERROR(ROUND(Tabla1[[#This Row],[Haberes \nmensuales]]/Tabla1[[#This Row],[Índice \nRIPTE]]*$G$12,2),0)","v":0},{"$f":"ROUND(Tabla1[[#This Row],[Haberes Actualizados]]/DAY(EOMONTH(Tabla1[[#This Row],[Mes Haberes]],0))*Tabla1[[#This Row],[Días \ntrabajados]],2)","v":0}]
[null,null,null,"2017-04-01",{"$f":"IFERROR((DATEDIF($F$12,MIN(EOMONTH(Tabla1[[#This Row],[Mes Haberes]],0),$F$13),\"d\")),0)-SUM($E$43:E57)","v":0},null,2589.02,{"$f":"IFERROR(ROUND(Tabla1[[#This Row],[Haberes \nmensuales]]/Tabla1[[#This Row],[Índice \nRIPTE]]*$G$12,2),0)","v":0},{"$f":"ROUND(Tabla1[[#This Row],[Haberes Actualizados]]/DAY(EOMONTH(Tabla1[[#This Row],[Mes Haberes]],0))*Tabla1[[#This Row],[Días \ntrabajados]],2)","v":0}]
[null,null,null,"2017-05-01",{"$f":"IFERROR((DATEDIF($F$12,MIN(EOMONTH(Tabla1[[#This Row],[Mes Haberes]],0),$F$13),\"d\")),0)-SUM($E$43:E58)","v":0},null,2632.39,{"$f":"IFERROR(ROUND(Tabla1[[#This Row],[Haberes \nmensuales]]/Tabla1[[#This Row],[Índice \nRIPTE]]*$G$12,2),0)","v":0},{"$f":"ROUND(Tabla1[[#This Row],[Haberes Actualizados]]/DAY(EOMONTH(Tabla1[[#This Row],[Mes Haberes]],0))*Tabla1[[#This Row],[Días \ntrabajados]],2)","v":0}]
[null,null,null,"2017-06-01",{"$f":"IFERROR((DATEDIF($F$12,MIN(EOMONTH(Tabla1[[#This Row],[Mes Haberes]],0),$F$13),\"d\")),0)-SUM($E$43:E59)","v":0},null,2682.68,{"$f":"IFERROR(ROUND(Tabla1[[#This Row],[Haberes \nmensuales]]/Tabla1[[#This Row],[Índice \nRIPTE]]*$G$12,2),0)","v":0},{"$f":"ROUND(Tabla1[[#This Row],[Haberes Actualizados]]/DAY(EOMONTH(Tabla1[[#This Row],[Mes Haberes]],0))*Tabla1[[#This Row],[Días \ntrabajados]],2)","v":0}]
[null,null,null,"2017-07-01",{"$f":"IFERROR((DATEDIF($F$12,MIN(EOMONTH(Tabla1[[#This Row],[Mes Haberes]],0),$F$13),\"d\")),0)-SUM($E$43:E60)","v":0},null,2799.18,{"$f":"IFERROR(ROUND(Tabla1[[#This Row],[Haberes \nmensuales]]/Tabla1[[#This Row],[Índice \nRIPTE]]*$G$12,2),0)","v":0},{"$f":"ROUND(Tabla1[[#This Row],[Haberes Actualizados]]/DAY(EOMONTH(Tabla1[[#This Row],[Mes Haberes]],0))*Tabla1[[#This Row],[Días \ntrabajados]],2)","v":0}]
[null,null,null,"2017-08-01",{"$f":"IFERROR((DATEDIF($F$12,MIN(EOMONTH(Tabla1[[#This Row],[Mes Haberes]],0),$F$13),\"d\")),0)-SUM($E$43:E61)","v":0},null,2823.33,{"$f":"IFERROR(ROUND(Tabla1[[#This Row],[Haberes \nmensuales]]/Tabla1[[#This Row],[Índice \nRIPTE]]*$G$12,2),0)","v":0},{"$f":"ROUND(Tabla1[[#This Row],[Haberes Actualizados]]/DAY(EOMONTH(Tabla1[[#This Row],[Mes Haberes]],0))*Tabla1[[#This Row],[Días \ntrabajados]],2)","v":0}]
[null,null,null,"2017-09-01",{"$f":"IFERROR((DATEDIF($F$12,MIN(EOMONTH(Tabla1[[#This Row],[Mes Haberes]],0),$F$13),\"d\")),0)-SUM($E$43:E62)","v":0},null,2873.15,{"$f":"IFERROR(ROUND(Tabla1[[#This Row],[Haberes \nmensuales]]/Tabla1[[#This Row],[Índice \nRIPTE]]*$G$12,2),0)","v":0},{"$f":"ROUND(Tabla1[[#This Row],[Haberes Actualizados]]/DAY(EOMONTH(Tabla1[[#This Row],[Mes Haberes]],0))*Tabla1[[#This Row],[Días \ntrabajados]],2)","v":0}]
[null,null,null,"2017-10-01",{"$f":"IFERROR((DATEDIF($F$12,MIN(EOMONTH(Tabla1[[#This Row],[Mes Haberes]],0),$F$13),\"d\")),0)-SUM($E$43:E63)","v":0},null,2953.98,{"$f":"IFERROR(ROUND(Tabla1[[#This Row],[Haberes \nmensuales]]/Tabla1[[#This Row],[Índice \nRIPTE]]*$G$12,2),0)","v":0},{"$f":"ROUND(Tabla1[[#This Row],[Haberes Actualizados]]/DAY(EOMONTH(Tabla1[[#This Row],[Mes Haberes]],0))*Tabla1[[#This Row],[Días \ntrabajados]],2)","v":0}]
[null,null,null,"2017-11-01",{"$f":"IFERROR((DATEDIF($F$12,MIN(EOMONTH(Tabla1[[#This Row],[Mes Haberes]],0),$F$13),\"d\")),0)-SUM($E$43:E64)","v":0},null,2992.14,{"$f":"IFERROR(ROUND(Tabla1[[#This Row],[Haberes \nmensuales]]/Tabla1[[#This Row],[Índice \nRIPTE]]*$G$12,2),0)","v":0},{"$f":"ROUND(Tabla1[[#This Row],[Haberes Actualizados]]/DAY(EOMONTH(Tabla1[[#This Row],[Mes Haberes]],0))*Tabla1[[#This Row],[Días \ntrabajados]],2)","v":0}]
[null,null,null,"2017-12-01",{"$f":"IFERROR((DATEDIF($F$12,MIN(EOMONTH(Tabla1[[#This Row],[Mes Haberes]],0),$F$13),\"d\")),0)-SUM($E$43:E65)","v":0},null,3006.32,{"$f":"IFERROR(ROUND(Tabla1[[#This Row],[Haberes \nmensuales]]/Tabla1[[#This Row],[Índice \nRIPTE]]*$G$12,2),0)","v":0},{"$f":"ROUND(Tabla1[[#This Row],[Haberes Actualizados]]/DAY(EOMONTH(Tabla1[[#This Row],[Mes Haberes]],0))*Tabla1[[#This Row],[Días \ntrabajados]],2)","v":0}]
[null,null,null,"2018-01-01",{"$f":"IFERROR((DATEDIF($F$12,MIN(EOMONTH(Tabla1[[#This Row],[Mes Haberes]],0),$F$13),\"d\")),0)-SUM($E$43:E66)","v":0},null,3078.15,{"$f":"IFERROR(ROUND(Tabla1[[#This Row],[Haberes \nmensuales]]/Tabla1[[#This Row],[Índice \nRIPTE]]*$G$12,2),0)","v":0},{"$f":"ROUND(Tabla1[[#This Row],[Haberes Actualizados]]/DAY(EOMONTH(Tabla1[[#This Row],[Mes Haberes]],0))*Tabla1[[#This Row],[Días \ntrabajados]],2)","v":0}]
[null,null,null,"2018-02-01",{"$f":"IFERROR((DATEDIF($F$12,MIN(EOMONTH(Tabla1[[#This Row],[Mes Haberes]],0),$F$13),\"d\")),0)-SUM($E$43:E67)","v":0},null,3136.49,{"$f":"IFERROR(ROUND(Tabla1[[#This Row],[Haberes \nmensuales]]/Tabla1[[#This Row],[Índice \nRIPTE]]*$G$12,2),0)","v":0},{"$f":"ROUND(Tabla1[[#This Row],[Haberes Actualizados]]/DAY(EOMONTH(Tabla1[[#This Row],[Mes Haberes]],0))*Tabla1[[#This Row],[Días \ntrabajados]],2)","v":0}]
[null,null,null,"2018-03-01",{"$f":"IFERROR((DATEDIF($F$12,MIN(EOMONTH(Tabla1[[#This Row],[Mes Haberes]],0),$F$13),\"d\")),0)-SUM($E$43:E68)","v":0},null,3208.74,{"$f":"IFERROR(ROUND(Tabla1[[#This Row],[Haberes \nmensuales]]/Tabla1[[#This Row],[Índice \nRIPTE]]*$G$12,2),0)","v":0},{"$f":"ROUND(Tabla1[[#This Row],[Haberes Actualizados]]/DAY(EOMONTH(Tabla1[[#This Row],[Mes Haberes]],0))*Tabla1[[#This Row],[Días \ntrabajados]],2)","v":0}]
[null,null,null,"2018-04-01",{"$f":"IFERROR((DATEDIF($F$12,MIN(EOMONTH(Tabla1[[#This Row],[Mes Haberes]],0),$F$13),\"d\")),0)-SUM($E$43:E69)","v":0},null,3298.55,{"$f":"IFERROR(ROUND(Tabla1[[#This Row],[Haberes \nmensuales]]/Tabla1[[#This Row],[Índice \nRIPTE]]*$G$12,2),0)","v":0},{"$f":"ROUND(Tabla1[[#This Row],[Haberes Actualizados]]/DAY(EOMONTH(Tabla1[[#This Row],[Mes Haberes]],0))*Tabla1[[#This Row],[Días \ntrabajados]],2)","v":0}]
[null,null,null,"2018-05-01",{"$f":"IFERROR((DATEDIF($F$12,MIN(EOMONTH(Tabla1[[#This Row],[Mes Haberes]],0),$F$13),\"d\")),0)-SUM($E$43:E70)","v":0},null,3353.5,{"$f":"IFERROR(ROUND(Tabla1[[#This Row],[Haberes \nmensuales]]/Tabla1[[#This Row],[Índice \nRIPTE]]*$G$12,2),0)","v":0},{"$f":"ROUND(Tabla1[[#This Row],[Haberes Actualizados]]/DAY(EOMONTH(Tabla1[[#This Row],[Mes Haberes]],0))*Tabla1[[#This Row],[Días \ntrabajados]],2)","v":0}]
[null,null,null,"2018-06-01",{"$f":"IFERROR((DATEDIF($F$12,MIN(EOMONTH(Tabla1[[#This Row],[Mes Haberes]],0),$F$13),\"d\")),0)-SUM($E$43:E71)","v":0},null,3383.14,{"$f":"IFERROR(ROUND(Tabla1[[#This Row],[Haberes \nmensuales]]/Tabla1[[#This Row],[Índice \nRIPTE]]*$G$12,2),0)","v":0},{"$f":"ROUND(Tabla1[[#This Row],[Haberes Actualizados]]/DAY(EOMONTH(Tabla1[[#This Row],[Mes Haberes]],0))*Tabla1[[#This Row],[Días \ntrabajados]],2)","v":0}]
[null,null,null,"2018-07-01",{"$f":"IFERROR((DATEDIF($F$12,MIN(EOMONTH(Tabla1[[#This Row],[Mes Haberes]],0),$F$13),\"d\")),0)-SUM($E$43:E72)","v":0},null,3461.52,{"$f":"IFERROR(ROUND(Tabla1[[#This Row],[Haberes \nmensuales]]/Tabla1[[#This Row],[Índice \nRIPTE]]*$G$12,2),0)","v":0},{"$f":"ROUND(Tabla1[[#This Row],[Haberes Actualizados]]/DAY(EOMONTH(Tabla1[[#This Row],[Mes Haberes]],0))*Tabla1[[#This Row],[Días \ntrabajados]],2)","v":0}]
[null,null,null,"2018-08-01",{"$f":"IFERROR((DATEDIF($F$12,MIN(EOMONTH(Tabla1[[#This Row],[Mes Haberes]],0),$F$13),\"d\")),0)-SUM($E$43:E73)","v":0},null,3540.95,{"$f":"IFERROR(ROUND(Tabla1[[#This Row],[Haberes \nmensuales]]/Tabla1[[#This Row],[Índice \nRIPTE]]*$G$12,2),0)","v":0},{"$f":"ROUND(Tabla1[[#This Row],[Haberes Actualizados]]/DAY(EOMONTH(Tabla1[[#This Row],[Mes Haberes]],0))*Tabla1[[#This Row],[Días \ntrabajados]],2)","v":0}]
[null,null,null,"2018-09-01",{"$f":"IFERROR((DATEDIF($F$12,MIN(EOMONTH(Tabla1[[#This Row],[Mes Haberes]],0),$F$13),\"d\")),0)-SUM($E$43:E74)","v":0},null,3603.23,{"$f":"IFERROR(ROUND(Tabla1[[#This Row],[Haberes \nmensuales]]/Tabla1[[#This Row],[Índice \nRIPTE]]*$G$12,2),0)","v":0},{"$f":"ROUND(Tabla1[[#This Row],[Haberes Actualizados]]/DAY(EOMONTH(Tabla1[[#This Row],[Mes Haberes]],0))*Tabla1[[#This Row],[Días \ntrabajados]],2)","v":0}]
[null,null,null,"2018-10-01",{"$f":"IFERROR((DATEDIF($F$12,MIN(EOMONTH(Tabla1[[#This Row],[Mes Haberes]],0),$F$13),\"d\")),0)-SUM($E$43:E75)","v":0},null,3789.62,{"$f":"IFERROR(ROUND(Tabla1[[#This Row],[Haberes \nmensuales]]/Tabla1[[#This Row],[Índice \nRIPTE]]*$G$12,2),0)","v":0},{"$f":"ROUND(Tabla1[[#This Row],[Haberes Actualizados]]/DAY(EOMONTH(Tabla1[[#This Row],[Mes Haberes]],0))*Tabla1[[#This Row],[Días \ntrabajados]],2)","v":0}]
[null,null,null,"2018-11-01",{"$f":"IFERROR((DATEDIF($F$12,MIN(EOMONTH(Tabla1[[#This Row],[Mes Haberes]],0),$F$13),\"d\")),0)-SUM($E$43:E76)","v":0},null,3855.86,{"$f":"IFERROR(ROUND(Tabla1[[#This Row],[Haberes \nmensuales]]/Tabla1[[#This Row],[Índice \nRIPTE]]*$G$12,2),0)","v":0},{"$f":"ROUND(Tabla1[[#This Row],[Haberes Actualizados]]/DAY(EOMONTH(Tabla1[[#This Row],[Mes Haberes]],0))*Tabla1[[#This Row],[Días \ntrabajados]],2)","v":0}]
[null,null,null,"2018-12-01",{"$f":"IFERROR((DATEDIF($F$12,MIN(EOMONTH(Tabla1[[#This Row],[Mes Haberes]],0),$F$13),\"d\")),0)-SUM($E$43:E77)","v":0},null,3925.11,{"$f":"IFERROR(ROUND(Tabla1[[#This Row],[Haberes \nmensuales]]/Tabla1[[#This Row],[Índice \nRIPTE]]*$G$12,2),0)","v":0},{"$f":"ROUND(Tabla1[[#This Row],[Haberes Actualizados]]/DAY(EOMONTH(Tabla1[[#This Row],[Mes Haberes]],0))*Tabla1[[#This Row],[Días \ntrabajados]],2)","v":0}]
[null,null,null,"2019-01-01",{"$f":"IFERROR((DATEDIF($F$12,MIN(EOMONTH(Tabla1[[#This Row],[Mes Haberes]],0),$F$13),\"d\")),0)-SUM($E$43:E78)","v":0},null,4042,{"$f":"IFERROR(ROUND(Tabla1[[#This Row],[Haberes \nmensuales]]/Tabla1[[#This Row],[Índice \nRIPTE]]*$G$12,2),0)","v":0},{"$f":"ROUND(Tabla1[[#This Row],[Haberes Actualizados]]/DAY(EOMONTH(Tabla1[[#This Row],[Mes Haberes]],0))*Tabla1[[#This Row],[Días \ntrabajados]],2)","v":0}]
[null,null,null,"2019-02-01",{"$f":"IFERROR((DATEDIF($F$12,MIN(EOMONTH(Tabla1[[#This Row],[Mes Haberes]],0),$F$13),\"d\")),0)-SUM($E$43:E79)","v":0},null,4198.76,{"$f":"IFERROR(ROUND(Tabla1[[#This Row],[Haberes \nmensuales]]/Tabla1[[#This Row],[Índice \nRIPTE]]*$G$12,2),0)","v":0},{"$f":"ROUND(Tabla1[[#This Row],[Haberes Actualizados]]/DAY(EOMONTH(Tabla1[[#This Row],[Mes Haberes]],0))*Tabla1[[#This Row],[Días \ntrabajados]],2)","v":0}]
[null,null,null,"2019-03-01",{"$f":"IFERROR((DATEDIF($F$12,MIN(EOMONTH(Tabla1[[#This Row],[Mes Haberes]],0),$F$13),\"d\")),0)-SUM($E$43:E80)","v":0},null,4444.6000000000004,{"$f":"IFERROR(ROUND(Tabla1[[#This Row],[Haberes \nmensuales]]/Tabla1[[#This Row],[Índice \nRIPTE]]*$G$12,2),0)","v":0},{"$f":"ROUND(Tabla1[[#This Row],[Haberes Actualizados]]/DAY(EOMONTH(Tabla1[[#This Row],[Mes Haberes]],0))*Tabla1[[#This Row],[Días \ntrabajados]],2)","v":0}]
[null,null,null,"2019-04-01",{"$f":"IFERROR((DATEDIF($F$12,MIN(EOMONTH(Tabla1[[#This Row],[Mes Haberes]],0),$F$13),\"d\")),0)-SUM($E$43:E81)","v":0},null,4533.03,{"$f":"IFERROR(ROUND(Tabla1[[#This Row],[Haberes \nmensuales]]/Tabla1[[#This Row],[Índice \nRIPTE]]*$G$12,2),0)","v":0},{"$f":"ROUND(Tabla1[[#This Row],[Haberes Actualizados]]/DAY(EOMONTH(Tabla1[[#This Row],[Mes Haberes]],0))*Tabla1[[#This Row],[Días \ntrabajados]],2)","v":0}]
[null,null,null,"2019-05-01",{"$f":"IFERROR((DATEDIF($F$12,MIN(EOMONTH(Tabla1[[#This Row],[Mes Haberes]],0),$F$13),\"d\")),0)-SUM($E$43:E82)","v":0},null,4676.25,{"$f":"IFERROR(ROUND(Tabla1[[#This Row],[Haberes \nmensuales]]/Tabla1[[#This Row],[Índice \nRIPTE]]*$G$12,2),0)","v":0},{"$f":"ROUND(Tabla1[[#This Row],[Haberes Actualizados]]/DAY(EOMONTH(Tabla1[[#This Row],[Mes Haberes]],0))*Tabla1[[#This Row],[Días \ntrabajados]],2)","v":0}]
[null,null,null,"2019-06-01",{"$f":"IFERROR((DATEDIF($F$12,MIN(EOMONTH(Tabla1[[#This Row],[Mes Haberes]],0),$F$13),\"d\")),0)-SUM($E$43:E83)","v":0},null,4753.1899999999996,{"$f":"IFERROR(ROUND(Tabla1[[#This Row],[Haberes \nmensuales]]/Tabla1[[#This Row],[Índice \nRIPTE]]*$G$12,2),0)","v":0},{"$f":"ROUND(Tabla1[[#This Row],[Haberes Actualizados]]/DAY(EOMONTH(Tabla1[[#This Row],[Mes Haberes]],0))*Tabla1[[#This Row],[Días \ntrabajados]],2)","v":0}]
[null,null,null,"2019-07-01",{"$f":"IFERROR((DATEDIF($F$12,MIN(EOMONTH(Tabla1[[#This Row],[Mes Haberes]],0),$F$13),\"d\")),0)-SUM($E$43:E84)","v":0},null,4948.2700000000004,{"$f":"IFERROR(ROUND(Tabla1[[#This Row],[Haberes \nmensuales]]/Tabla1[[#This Row],[Índice \nRIPTE]]*$G$12,2),0)","v":0},{"$f":"ROUND(Tabla1[[#This Row],[Haberes Actualizados]]/DAY(EOMONTH(Tabla1[[#This Row],[Mes Haberes]],0))*Tabla1[[#This Row],[Días \ntrabajados]],2)","v":0}]
[null,null,null,"2019-08-01",{"$f":"IFERROR((DATEDIF($F$12,MIN(EOMONTH(Tabla1[[#This Row],[Mes Haberes]],0),$F$13),\"d\")),0)-SUM($E$43:E85)","v":0},null,5039.93,{"$f":"IFERROR(ROUND(Tabla1[[#This Row],[Haberes \nmensuales]]/Tabla1[[#This Row],[Índice \nRIPTE]]*$G$12,2),0)","v":0},{"$f":"ROUND(Tabla1[[#This Row],[Haberes Actualizados]]/DAY(EOMONTH(Tabla1[[#This Row],[Mes Haberes]],0))*Tabla1[[#This Row],[Días \ntrabajados]],2)","v":0}]
[null,null,null,"2019-09-01",{"$f":"IFERROR((DATEDIF($F$12,MIN(EOMONTH(Tabla1[[#This Row],[Mes Haberes]],0),$F$13),\"d\")),0)-SUM($E$43:E86)","v":0},null,5199.08,{"$f":"IFERROR(ROUND(Tabla1[[#This Row],[Haberes \nmensuales]]/Tabla1[[#This Row],[Índice \nRIPTE]]*$G$12,2),0)","v":0},{"$f":"ROUND(Tabla1[[#This Row],[Haberes Actualizados]]/DAY(EOMONTH(Tabla1[[#This Row],[Mes Haberes]],0))*Tabla1[[#This Row],[Días \ntrabajados]],2)","v":0}]
[null,null,null,"2019-10-01",{"$f":"IFERROR((DATEDIF($F$12,MIN(EOMONTH(Tabla1[[#This Row],[Mes Haberes]],0),$F$13),\"d\")),0)-SUM($E$43:E87)","v":0},null,5467.59,{"$f":"IFERROR(ROUND(Tabla1[[#This Row],[Haberes \nmensuales]]/Tabla1[[#This Row],[Índice \nRIPTE]]*$G$12,2),0)","v":0},{"$f":"ROUND(Tabla1[[#This Row],[Haberes Actualizados]]/DAY(EOMONTH(Tabla1[[#This Row],[Mes Haberes]],0))*Tabla1[[#This Row],[Días \ntrabajados]],2)","v":0}]
[null,null,null,"2019-11-01",{"$f":"IFERROR((DATEDIF($F$12,MIN(EOMONTH(Tabla1[[#This Row],[Mes Haberes]],0),$F$13),\"d\")),0)-SUM($E$43:E88)","v":0},null,5554.15,{"$f":"IFERROR(ROUND(Tabla1[[#This Row],[Haberes \nmensuales]]/Tabla1[[#This Row],[Índice \nRIPTE]]*$G$12,2),0)","v":0},{"$f":"ROUND(Tabla1[[#This Row],[Haberes Actualizados]]/DAY(EOMONTH(Tabla1[[#This Row],[Mes Haberes]],0))*Tabla1[[#This Row],[Días \ntrabajados]],2)","v":0}]
[null,null,null,"2019-12-01",{"$f":"IFERROR((DATEDIF($F$12,MIN(EOMONTH(Tabla1[[#This Row],[Mes Haberes]],0),$F$13),\"d\")),0)-SUM($E$43:E89)","v":0},null,5666.48,{"$f":"IFERROR(ROUND(Tabla1[[#This Row],[Haberes \nmensuales]]/Tabla1[[#This Row],[Índice \nRIPTE]]*$G$12,2),0)","v":0},{"$f":"ROUND(Tabla1[[#This Row],[Haberes Actualizados]]/DAY(EOMONTH(Tabla1[[#This Row],[Mes Haberes]],0))*Tabla1[[#This Row],[Días \ntrabajados]],2)","v":0}]
[null,null,null,"2020-01-01",{"$f":"IFERROR((DATEDIF($F$12,MIN(EOMONTH(Tabla1[[#This Row],[Mes Haberes]],0),$F$13),\"d\")),0)-SUM($E$43:E90)","v":0},null,6066.07,{"$f":"IFERROR(ROUND(Tabla1[[#This Row],[Haberes \nmensuales]]/Tabla1[[#This Row],[Índice \nRIPTE]]*$G$12,2),0)","v":0},{"$f":"ROUND(Tabla1[[#This Row],[Haberes Actualizados]]/DAY(EOMONTH(Tabla1[[#This Row],[Mes Haberes]],0))*Tabla1[[#This Row],[Días \ntrabajados]],2)","v":0}]
[null,null,null,"2020-02-01",{"$f":"IFERROR((DATEDIF($F$12,MIN(EOMONTH(Tabla1[[#This Row],[Mes Haberes]],0),$F$13),\"d\")),0)-SUM($E$43:E91)","v":0},null,6445.13,{"$f":"IFERROR(ROUND(Tabla1[[#This Row],[Haberes \nmensuales]]/Tabla1[[#This Row],[Índice \nRIPTE]]*$G$12,2),0)","v":0},{"$f":"ROUND(Tabla1[[#This Row],[Haberes Actualizados]]/DAY(EOMONTH(Tabla1[[#This Row],[Mes Haberes]],0))*Tabla1[[#This Row],[Días \ntrabajados]],2)","v":0}]
[null,null,null,"2020-03-01",{"$f":"IFERROR((DATEDIF($F$12,MIN(EOMONTH(Tabla1[[#This Row],[Mes Haberes]],0),$F$13),\"d\")),0)-SUM($E$43:E92)","v":0},null,6500.72,{"$f":"IFERROR(ROUND(Tabla1[[#This Row],[Haberes \nmensuales]]/Tabla1[[#This Row],[Índice \nRIPTE]]*$G$12,2),0)","v":0},{"$f":"ROUND(Tabla1[[#This Row],[Haberes Actualizados]]/DAY(EOMONTH(Tabla1[[#This Row],[Mes Haberes]],0))*Tabla1[[#This Row],[Días \ntrabajados]],2)","v":0}]
[null,null,null,"2020-04-01",{"$f":"IFERROR((DATEDIF($F$12,MIN(EOMONTH(Tabla1[[#This Row],[Mes Haberes]],0),$F$13),\"d\")),0)-SUM($E$43:E93)","v":0},null,6510.18,{"$f":"IFERROR(ROUND(Tabla1[[#This Row],[Haberes \nmensuales]]/Tabla1[[#This Row],[Índice \nRIPTE]]*$G$12,2),0)","v":0},{"$f":"ROUND(Tabla1[[#This Row],[Haberes Actualizados]]/DAY(EOMONTH(Tabla1[[#This Row],[Mes Haberes]],0))*Tabla1[[#This Row],[Días \ntrabajados]],2)","v":0}]
[null,null,null,"2020-05-01",{"$f":"IFERROR((DATEDIF($F$12,MIN(EOMONTH(Tabla1[[#This Row],[Mes Haberes]],0),$F$13),\"d\")),0)-SUM($E$43:E94)","v":0},null,6521.87,{"$f":"IFERROR(ROUND(Tabla1[[#This Row],[Haberes \nmensuales]]/Tabla1[[#This Row],[Índice \nRIPTE]]*$G$12,2),0)","v":0},{"$f":"ROUND(Tabla1[[#This Row],[Haberes Actualizados]]/DAY(EOMONTH(Tabla1[[#This Row],[Mes Haberes]],0))*Tabla1[[#This Row],[Días \ntrabajados]],2)","v":0}]
[null,null,null,"2020-06-01",{"$f":"IFERROR((DATEDIF($F$12,MIN(EOMONTH(Tabla1[[#This Row],[Mes Haberes]],0),$F$13),\"d\")),0)-SUM($E$43:E95)","v":0},null,6670.93,{"$f":"IFERROR(ROUND(Tabla1[[#This Row],[Haberes \nmensuales]]/Tabla1[[#This Row],[Índice \nRIPTE]]*$G$12,2),0)","v":0},{"$f":"ROUND(Tabla1[[#This Row],[Haberes Actualizados]]/DAY(EOMONTH(Tabla1[[#This Row],[Mes Haberes]],0))*Tabla1[[#This Row],[Días \ntrabajados]],2)","v":0}]
[null,null,null,"2020-07-01",{"$f":"IFERROR((DATEDIF($F$12,MIN(EOMONTH(Tabla1[[#This Row],[Mes Haberes]],0),$F$13),\"d\")),0)-SUM($E$43:E96)","v":0},null,6908.52,{"$f":"IFERROR(ROUND(Tabla1[[#This Row],[Haberes \nmensuales]]/Tabla1[[#This Row],[Índice \nRIPTE]]*$G$12,2),0)","v":0},{"$f":"ROUND(Tabla1[[#This Row],[Haberes Actualizados]]/DAY(EOMONTH(Tabla1[[#This Row],[Mes Haberes]],0))*Tabla1[[#This Row],[Días \ntrabajados]],2)","v":0}]
[null,null,null,"2020-08-01",{"$f":"IFERROR((DATEDIF($F$12,MIN(EOMONTH(Tabla1[[#This Row],[Mes Haberes]],0),$F$13),\"d\")),0)-SUM($E$43:E97)","v":0},null,6945.86,{"$f":"IFERROR(ROUND(Tabla1[[#This Row],[Haberes \nmensuales]]/Tabla1[[#This Row],[Índice \nRIPTE]]*$G$12,2),0)","v":0},{"$f":"ROUND(Tabla1[[#This Row],[Haberes Actualizados]]/DAY(EOMONTH(Tabla1[[#This Row],[Mes Haberes]],0))*Tabla1[[#This Row],[Días \ntrabajados]],2)","v":0}]
[null,null,null,"2020-09-01",{"$f":"IFERROR((DATEDIF($F$12,MIN(EOMONTH(Tabla1[[#This Row],[Mes Haberes]],0),$F$13),\"d\")),0)-SUM($E$43:E98)","v":0},null,7076.47,{"$f":"IFERROR(ROUND(Tabla1[[#This Row],[Haberes \nmensuales]]/Tabla1[[#This Row],[Índice \nRIPTE]]*$G$12,2),0)","v":0},{"$f":"ROUND(Tabla1[[#This Row],[Haberes Actualizados]]/DAY(EOMONTH(Tabla1[[#This Row],[Mes Haberes]],0))*Tabla1[[#This Row],[Días \ntrabajados]],2)","v":0}]
[null,null,null,"2020-10-01",{"$f":"IFERROR((DATEDIF($F$12,MIN(EOMONTH(Tabla1[[#This Row],[Mes Haberes]],0),$F$13),\"d\")),0)-SUM($E$43:E99)","v":0},null,7401.81,{"$f":"IFERROR(ROUND(Tabla1[[#This Row],[Haberes \nmensuales]]/Tabla1[[#This Row],[Índice \nRIPTE]]*$G$12,2),0)","v":0},{"$f":"ROUND(Tabla1[[#This Row],[Haberes Actualizados]]/DAY(EOMONTH(Tabla1[[#This Row],[Mes Haberes]],0))*Tabla1[[#This Row],[Días \ntrabajados]],2)","v":0}]
[null,null,null,"2020-11-01",{"$f":"IFERROR((DATEDIF($F$12,MIN(EOMONTH(Tabla1[[#This Row],[Mes Haberes]],0),$F$13),\"d\")),0)-SUM($E$43:E100)","v":0},null,7495.03,{"$f":"IFERROR(ROUND(Tabla1[[#This Row],[Haberes \nmensuales]]/Tabla1[[#This Row],[Índice \nRIPTE]]*$G$12,2),0)","v":0},{"$f":"ROUND(Tabla1[[#This Row],[Haberes Actualizados]]/DAY(EOMONTH(Tabla1[[#This Row],[Mes Haberes]],0))*Tabla1[[#This Row],[Días \ntrabajados]],2)","v":0}]
[null,null,null,"2020-12-01",{"$f":"IFERROR((DATEDIF($F$12,MIN(EOMONTH(Tabla1[[#This Row],[Mes Haberes]],0),$F$13),\"d\")),0)-SUM($E$43:E101)","v":0},null,7643.41,{"$f":"IFERROR(ROUND(Tabla1[[#This Row],[Haberes \nmensuales]]/Tabla1[[#This Row],[Índice \nRIPTE]]*$G$12,2),0)","v":0},{"$f":"ROUND(Tabla1[[#This Row],[Haberes Actualizados]]/DAY(EOMONTH(Tabla1[[#This Row],[Mes Haberes]],0))*Tabla1[[#This Row],[Días \ntrabajados]],2)","v":0}]
[null,null,null,"2021-01-01",{"$f":"IFERROR((DATEDIF($F$12,MIN(EOMONTH(Tabla1[[#This Row],[Mes Haberes]],0),$F$13),\"d\")),0)-SUM($E$43:E102)","v":0},null,7784.1,{"$f":"IFERROR(ROUND(Tabla1[[#This Row],[Haberes \nmensuales]]/Tabla1[[#This Row],[Índice \nRIPTE]]*$G$12,2),0)","v":0},{"$f":"ROUND(Tabla1[[#This Row],[Haberes Actualizados]]/DAY(EOMONTH(Tabla1[[#This Row],[Mes Haberes]],0))*Tabla1[[#This Row],[Días \ntrabajados]],2)","v":0}]
[null,null,null,"2021-02-01",{"$f":"IFERROR((DATEDIF($F$12,MIN(EOMONTH(Tabla1[[#This Row],[Mes Haberes]],0),$F$13),\"d\")),0)-SUM($E$43:E103)","v":0},null,8263.33,{"$f":"IFERROR(ROUND(Tabla1[[#This Row],[Haberes \nmensuales]]/Tabla1[[#This Row],[Índice \nRIPTE]]*$G$12,2),0)","v":0},{"$f":"ROUND(Tabla1[[#This Row],[Haberes Actualizados]]/DAY(EOMONTH(Tabla1[[#This Row],[Mes Haberes]],0))*Tabla1[[#This Row],[Días \ntrabajados]],2)","v":0}]
[null,null,null,"2021-03-01",{"$f":"IFERROR((DATEDIF($F$12,MIN(EOMONTH(Tabla1[[#This Row],[Mes Haberes]],0),$F$13),\"d\")),0)-SUM($E$43:E104)","v":0},null,8665.19,{"$f":"IFERROR(ROUND(Tabla1[[#This Row],[Haberes \nmensuales]]/Tabla1[[#This Row],[Índice \nRIPTE]]*$G$12,2),0)","v":0},{"$f":"ROUND(Tabla1[[#This Row],[Haberes Actualizados]]/DAY(EOMONTH(Tabla1[[#This Row],[Mes Haberes]],0))*Tabla1[[#This Row],[Días \ntrabajados]],2)","v":0}]
[null,null,null,"2021-04-01",{"$f":"IFERROR((DATEDIF($F$12,MIN(EOMONTH(Tabla1[[#This Row],[Mes Haberes]],0),$F$13),\"d\")),0)-SUM($E$43:E105)","v":0},null,9201.59,{"$f":"IFERROR(ROUND(Tabla1[[#This Row],[Haberes \nmensuales]]/Tabla1[[#This Row],[Índice \nRIPTE]]*$G$12,2),0)","v":0},{"$f":"ROUND(Tabla1[[#This Row],[Haberes Actualizados]]/DAY(EOMONTH(Tabla1[[#This Row],[Mes Haberes]],0))*Tabla1[[#This Row],[Días \ntrabajados]],2)","v":0}]
[null,null,null,"2021-05-01",{"$f":"IFERROR((DATEDIF($F$12,MIN(EOMONTH(Tabla1[[#This Row],[Mes Haberes]],0),$F$13),\"d\")),0)-SUM($E$43:E106)","v":0},null,9311.61,{"$f":"IFERROR(ROUND(Tabla1[[#This Row],[Haberes \nmensuales]]/Tabla1[[#This Row],[Índice \nRIPTE]]*$G$12,2),0)","v":0},{"$f":"ROUND(Tabla1[[#This Row],[Haberes Actualizados]]/DAY(EOMONTH(Tabla1[[#This Row],[Mes Haberes]],0))*Tabla1[[#This Row],[Días \ntrabajados]],2)","v":0}]
[null,null,null,"2021-06-01",{"$f":"IFERROR((DATEDIF($F$12,MIN(EOMONTH(Tabla1[[#This Row],[Mes Haberes]],0),$F$13),\"d\")),0)-SUM($E$43:E107)","v":0},null,9660.1299999999992,{"$f":"IFERROR(ROUND(Tabla1[[#This Row],[Haberes \nmensuales]]/Tabla1[[#This Row],[Índice \nRIPTE]]*$G$12,2),0)","v":0},{"$f":"ROUND(Tabla1[[#This Row],[Haberes Actualizados]]/DAY(EOMONTH(Tabla1[[#This Row],[Mes Haberes]],0))*Tabla1[[#This Row],[Días \ntrabajados]],2)","v":0}]
[null,null,null,"2021-07-01",{"$f":"IFERROR((DATEDIF($F$12,MIN(EOMONTH(Tabla1[[#This Row],[Mes Haberes]],0),$F$13),\"d\")),0)-SUM($E$43:E108)","v":0},null,10089.959999999999,{"$f":"IFERROR(ROUND(Tabla1[[#This Row],[Haberes \nmensuales]]/Tabla1[[#This Row],[Índice \nRIPTE]]*$G$12,2),0)","v":0},{"$f":"ROUND(Tabla1[[#This Row],[Haberes Actualizados]]/DAY(EOMONTH(Tabla1[[#This Row],[Mes Haberes]],0))*Tabla1[[#This Row],[Días \ntrabajados]],2)","v":0}]
[null,null,null,"2021-08-01",{"$f":"IFERROR((DATEDIF($F$12,MIN(EOMONTH(Tabla1[[#This Row],[Mes Haberes]],0),$F$13),\"d\")),0)-SUM($E$43:E109)","v":0},null,10326.11,{"$f":"IFERROR(ROUND(Tabla1[[#This Row],[Haberes \nmensuales]]/Tabla1[[#This Row],[Índice \nRIPTE]]*$G$12,2),0)","v":0},{"$f":"ROUND(Tabla1[[#This Row],[Haberes Actualizados]]/DAY(EOMONTH(Tabla1[[#This Row],[Mes Haberes]],0))*Tabla1[[#This Row],[Días \ntrabajados]],2)","v":0}]
[null,null,null,"2021-09-01",{"$f":"IFERROR((DATEDIF($F$12,MIN(EOMONTH(Tabla1[[#This Row],[Mes Haberes]],0),$F$13),\"d\")),0)-SUM($E$43:E110)","v":0},null,10762.48,{"$f":"IFERROR(ROUND(Tabla1[[#This Row],[Haberes \nmensuales]]/Tabla1[[#This Row],[Índice \nRIPTE]]*$G$12,2),0)","v":0},{"$f":"ROUND(Tabla1[[#This Row],[Haberes Actualizados]]/DAY(EOMONTH(Tabla1[[#This Row],[Mes Haberes]],0))*Tabla1[[#This Row],[Días \ntrabajados]],2)","v":0}]
[null,null,null,"2021-10-01",{"$f":"IFERROR((DATEDIF($F$12,MIN(EOMONTH(Tabla1[[#This Row],[Mes Haberes]],0),$F$13),\"d\")),0)-SUM($E$43:E111)","v":0},null,11148.95,{"$f":"IFERROR(ROUND(Tabla1[[#This Row],[Haberes \nmensuales]]/Tabla1[[#This Row],[Índice \nRIPTE]]*$G$12,2),0)","v":0},{"$f":"ROUND(Tabla1[[#This Row],[Haberes Actualizados]]/DAY(EOMONTH(Tabla1[[#This Row],[Mes Haberes]],0))*Tabla1[[#This Row],[Días \ntrabajados]],2)","v":0}]
[null,null,null,"2021-11-01",{"$f":"IFERROR((DATEDIF($F$12,MIN(EOMONTH(Tabla1[[#This Row],[Mes Haberes]],0),$F$13),\"d\")),0)-SUM($E$43:E112)","v":0},null,11497.72,{"$f":"IFERROR(ROUND(Tabla1[[#This Row],[Haberes \nmensuales]]/Tabla1[[#This Row],[Índice \nRIPTE]]*$G$12,2),0)","v":0},{"$f":"ROUND(Tabla1[[#This Row],[Haberes Actualizados]]/DAY(EOMONTH(Tabla1[[#This Row],[Mes Haberes]],0))*Tabla1[[#This Row],[Días \ntrabajados]],2)","v":0}]
[null,null,null,"2021-12-01",{"$f":"IFERROR((DATEDIF($F$12,MIN(EOMONTH(Tabla1[[#This Row],[Mes Haberes]],0),$F$13),\"d\")),0)-SUM($E$43:E113)","v":0},null,11726.3,{"$f":"IFERROR(ROUND(Tabla1[[#This Row],[Haberes \nmensuales]]/Tabla1[[#This Row],[Índice \nRIPTE]]*$G$12,2),0)","v":0},{"$f":"ROUND(Tabla1[[#This Row],[Haberes Actualizados]]/DAY(EOMONTH(Tabla1[[#This Row],[Mes Haberes]],0))*Tabla1[[#This Row],[Días \ntrabajados]],2)","v":0}]
[null,null,null,"2022-01-01",{"$f":"IFERROR((DATEDIF($F$12,MIN(EOMONTH(Tabla1[[#This Row],[Mes Haberes]],0),$F$13),\"d\")),0)-SUM($E$43:E114)","v":0},null,12271.35,{"$f":"IFERROR(ROUND(Tabla1[[#This Row],[Haberes \nmensuales]]/Tabla1[[#This Row],[Índice \nRIPTE]]*$G$12,2),0)","v":0},{"$f":"ROUND(Tabla1[[#This Row],[Haberes Actualizados]]/DAY(EOMONTH(Tabla1[[#This Row],[Mes Haberes]],0))*Tabla1[[#This Row],[Días \ntrabajados]],2)","v":0}]
[null,null,null,"2022-02-01",{"$f":"IFERROR((DATEDIF($F$12,MIN(EOMONTH(Tabla1[[#This Row],[Mes Haberes]],0),$F$13),\"d\")),0)-SUM($E$43:E115)","v":0},null,12849.2,{"$f":"IFERROR(ROUND(Tabla1[[#This Row],[Haberes \nmensuales]]/Tabla1[[#This Row],[Índice \nRIPTE]]*$G$12,2),0)","v":0},{"$f":"ROUND(Tabla1[[#This Row],[Haberes Actualizados]]/DAY(EOMONTH(Tabla1[[#This Row],[Mes Haberes]],0))*Tabla1[[#This Row],[Días \ntrabajados]],2)","v":0}]
[null,null,null,"2022-03-01",{"$f":"IFERROR((DATEDIF($F$12,MIN(EOMONTH(Tabla1[[#This Row],[Mes Haberes]],0),$F$13),\"d\")),0)-SUM($E$43:E116)","v":0},null,13855.82,{"$f":"IFERROR(ROUND(Tabla1[[#This Row],[Haberes \nmensuales]]/Tabla1[[#This Row],[Índice \nRIPTE]]*$G$12,2),0)","v":0},{"$f":"ROUND(Tabla1[[#This Row],[Haberes Actualizados]]/DAY(EOMONTH(Tabla1[[#This Row],[Mes Haberes]],0))*Tabla1[[#This Row],[Días \ntrabajados]],2)","v":0}]
[null,null,null,"2022-04-01",{"$f":"IFERROR((DATEDIF($F$12,MIN(EOMONTH(Tabla1[[#This Row],[Mes Haberes]],0),$F$13),\"d\")),0)-SUM($E$43:E117)","v":0},null,14677.19,{"$f":"IFERROR(ROUND(Tabla1[[#This Row],[Haberes \nmensuales]]/Tabla1[[#This Row],[Índice \nRIPTE]]*$G$12,2),0)","v":0},{"$f":"ROUND(Tabla1[[#This Row],[Haberes Actualizados]]/DAY(EOMONTH(Tabla1[[#This Row],[Mes Haberes]],0))*Tabla1[[#This Row],[Días \ntrabajados]],2)","v":0}]
[null,null,null,"2022-05-01",{"$f":"IFERROR((DATEDIF($F$12,MIN(EOMONTH(Tabla1[[#This Row],[Mes Haberes]],0),$F$13),\"d\")),0)-SUM($E$43:E118)","v":0},null,15270.36,{"$f":"IFERROR(ROUND(Tabla1[[#This Row],[Haberes \nmensuales]]/Tabla1[[#This Row],[Índice \nRIPTE]]*$G$12,2),0)","v":0},{"$f":"ROUND(Tabla1[[#This Row],[Haberes Actualizados]]/DAY(EOMONTH(Tabla1[[#This Row],[Mes Haberes]],0))*Tabla1[[#This Row],[Días \ntrabajados]],2)","v":0}]
[null,null,null,"2022-06-01",{"$f":"IFERROR((DATEDIF($F$12,MIN(EOMONTH(Tabla1[[#This Row],[Mes Haberes]],0),$F$13),\"d\")),0)-SUM($E$43:E119)","v":0},null,16149.76,{"$f":"IFERROR(ROUND(Tabla1[[#This Row],[Haberes \nmensuales]]/Tabla1[[#This Row],[Índice \nRIPTE]]*$G$12,2),0)","v":0},{"$f":"ROUND(Tabla1[[#This Row],[Haberes Actualizados]]/DAY(EOMONTH(Tabla1[[#This Row],[Mes Haberes]],0))*Tabla1[[#This Row],[Días \ntrabajados]],2)","v":0}]
[null,null,null,"2022-07-01",{"$f":"IFERROR((DATEDIF($F$12,MIN(EOMONTH(Tabla1[[#This Row],[Mes Haberes]],0),$F$13),\"d\")),0)-SUM($E$43:E120)","v":0},null,17009.599999999999,{"$f":"IFERROR(ROUND(Tabla1[[#This Row],[Haberes \nmensuales]]/Tabla1[[#This Row],[Índice \nRIPTE]]*$G$12,2),0)","v":0},{"$f":"ROUND(Tabla1[[#This Row],[Haberes Actualizados]]/DAY(EOMONTH(Tabla1[[#This Row],[Mes Haberes]],0))*Tabla1[[#This Row],[Días \ntrabajados]],2)","v":0}]
[null,null,null,"2022-08-01",{"$f":"IFERROR((DATEDIF($F$12,MIN(EOMONTH(Tabla1[[#This Row],[Mes Haberes]],0),$F$13),\"d\")),0)-SUM($E$43:E121)","v":0},null,17786.79,{"$f":"IFERROR(ROUND(Tabla1[[#This Row],[Haberes \nmensuales]]/Tabla1[[#This Row],[Índice \nRIPTE]]*$G$12,2),0)","v":0},{"$f":"ROUND(Tabla1[[#This Row],[Haberes Actualizados]]/DAY(EOMONTH(Tabla1[[#This Row],[Mes Haberes]],0))*Tabla1[[#This Row],[Días \ntrabajados]],2)","v":0}]
[null,null,null,"2022-09-01",{"$f":"IFERROR((DATEDIF($F$12,MIN(EOMONTH(Tabla1[[#This Row],[Mes Haberes]],0),$F$13),\"d\")),0)-SUM($E$43:E122)","v":0},null,18908.07,{"$f":"IFERROR(ROUND(Tabla1[[#This Row],[Haberes \nmensuales]]/Tabla1[[#This Row],[Índice \nRIPTE]]*$G$12,2),0)","v":0},{"$f":"ROUND(Tabla1[[#This Row],[Haberes Actualizados]]/DAY(EOMONTH(Tabla1[[#This Row],[Mes Haberes]],0))*Tabla1[[#This Row],[Días \ntrabajados]],2)","v":0}]
[null,null,null,"2022-10-01",{"$f":"IFERROR((DATEDIF($F$12,MIN(EOMONTH(Tabla1[[#This Row],[Mes Haberes]],0),$F$13),\"d\")),0)-SUM($E$43:E123)","v":0},null,19938.61,{"$f":"IFERROR(ROUND(Tabla1[[#This Row],[Haberes \nmensuales]]/Tabla1[[#This Row],[Índice \nRIPTE]]*$G$12,2),0)","v":0},{"$f":"ROUND(Tabla1[[#This Row],[Haberes Actualizados]]/DAY(EOMONTH(Tabla1[[#This Row],[Mes Haberes]],0))*Tabla1[[#This Row],[Días \ntrabajados]],2)","v":0}]
[null,null,null,"2022-11-01",{"$f":"IFERROR((DATEDIF($F$12,MIN(EOMONTH(Tabla1[[#This Row],[Mes Haberes]],0),$F$13),\"d\")),0)-SUM($E$43:E124)","v":0},null,21055.73,{"$f":"IFERROR(ROUND(Tabla1[[#This Row],[Haberes \nmensuales]]/Tabla1[[#This Row],[Índice \nRIPTE]]*$G$12,2),0)","v":0},{"$f":"ROUND(Tabla1[[#This Row],[Haberes Actualizados]]/DAY(EOMONTH(Tabla1[[#This Row],[Mes Haberes]],0))*Tabla1[[#This Row],[Días \ntrabajados]],2)","v":0}]
[null,null,null,"2022-12-01",{"$f":"IFERROR((DATEDIF($F$12,MIN(EOMONTH(Tabla1[[#This Row],[Mes Haberes]],0),$F$13),\"d\")),0)-SUM($E$43:E125)","v":0},null,22194.74,{"$f":"IFERROR(ROUND(Tabla1[[#This Row],[Haberes \nmensuales]]/Tabla1[[#This Row],[Índice \nRIPTE]]*$G$12,2),0)","v":0},{"$f":"ROUND(Tabla1[[#This Row],[Haberes Actualizados]]/DAY(EOMONTH(Tabla1[[#This Row],[Mes Haberes]],0))*Tabla1[[#This Row],[Días \ntrabajados]],2)","v":0}]
[null,null,null,"2023-01-01",{"$f":"IFERROR((DATEDIF($F$12,MIN(EOMONTH(Tabla1[[#This Row],[Mes Haberes]],0),$F$13),\"d\")),0)-SUM($E$43:E126)","v":0},null,23041.17,{"$f":"IFERROR(ROUND(Tabla1[[#This Row],[Haberes \nmensuales]]/Tabla1[[#This Row],[Índice \nRIPTE]]*$G$12,2),0)","v":0},{"$f":"ROUND(Tabla1[[#This Row],[Haberes Actualizados]]/DAY(EOMONTH(Tabla1[[#This Row],[Mes Haberes]],0))*Tabla1[[#This Row],[Días \ntrabajados]],2)","v":0}]
[null,null,null,"2023-02-01",{"$f":"IFERROR((DATEDIF($F$12,MIN(EOMONTH(Tabla1[[#This Row],[Mes Haberes]],0),$F$13),\"d\")),0)-SUM($E$43:E127)","v":0},null,24980.16,{"$f":"IFERROR(ROUND(Tabla1[[#This Row],[Haberes \nmensuales]]/Tabla1[[#This Row],[Índice \nRIPTE]]*$G$12,2),0)","v":0},{"$f":"ROUND(Tabla1[[#This Row],[Haberes Actualizados]]/DAY(EOMONTH(Tabla1[[#This Row],[Mes Haberes]],0))*Tabla1[[#This Row],[Días \ntrabajados]],2)","v":0}]
[null,null,null,"2023-03-01",{"$f":"IFERROR((DATEDIF($F$12,MIN(EOMONTH(Tabla1[[#This Row],[Mes Haberes]],0),$F$13),\"d\")),0)-SUM($E$43:E128)","v":0},null,27419.24,{"$f":"IFERROR(ROUND(Tabla1[[#This Row],[Haberes \nmensuales]]/Tabla1[[#This Row],[Índice \nRIPTE]]*$G$12,2),0)","v":0},{"$f":"ROUND(Tabla1[[#This Row],[Haberes Actualizados]]/DAY(EOMONTH(Tabla1[[#This Row],[Mes Haberes]],0))*Tabla1[[#This Row],[Días \ntrabajados]],2)","v":0}]
[null,null,null,"2023-04-01",{"$f":"IFERROR((DATEDIF($F$12,MIN(EOMONTH(Tabla1[[#This Row],[Mes Haberes]],0),$F$13),\"d\")),0)-SUM($E$43:E129)","v":0},null,30116.61,{"$f":"IFERROR(ROUND(Tabla1[[#This Row],[Haberes \nmensuales]]/Tabla1[[#This Row],[Índice \nRIPTE]]*$G$12,2),0)","v":0},{"$f":"ROUND(Tabla1[[#This Row],[Haberes Actualizados]]/DAY(EOMONTH(Tabla1[[#This Row],[Mes Haberes]],0))*Tabla1[[#This Row],[Días \ntrabajados]],2)","v":0}]
[null,null,null,"2023-05-01",{"$f":"IFERROR((DATEDIF($F$12,MIN(EOMONTH(Tabla1[[#This Row],[Mes Haberes]],0),$F$13),\"d\")),0)-SUM($E$43:E130)","v":0},null,31984.22,{"$f":"IFERROR(ROUND(Tabla1[[#This Row],[Haberes \nmensuales]]/Tabla1[[#This Row],[Índice \nRIPTE]]*$G$12,2),0)","v":0},{"$f":"ROUND(Tabla1[[#This Row],[Haberes Actualizados]]/DAY(EOMONTH(Tabla1[[#This Row],[Mes Haberes]],0))*Tabla1[[#This Row],[Días \ntrabajados]],2)","v":0}]
[null,null,null,"2023-06-01",{"$f":"IFERROR((DATEDIF($F$12,MIN(EOMONTH(Tabla1[[#This Row],[Mes Haberes]],0),$F$13),\"d\")),0)-SUM($E$43:E131)","v":0},null,34583.730000000003,{"$f":"IFERROR(ROUND(Tabla1[[#This Row],[Haberes \nmensuales]]/Tabla1[[#This Row],[Índice \nRIPTE]]*$G$12,2),0)","v":0},{"$f":"ROUND(Tabla1[[#This Row],[Haberes Actualizados]]/DAY(EOMONTH(Tabla1[[#This Row],[Mes Haberes]],0))*Tabla1[[#This Row],[Días \ntrabajados]],2)","v":0}]
[null,null,null,"2023-07-01",{"$f":"IFERROR((DATEDIF($F$12,MIN(EOMONTH(Tabla1[[#This Row],[Mes Haberes]],0),$F$13),\"d\")),0)-SUM($E$43:E132)","v":0},null,37148.07,{"$f":"IFERROR(ROUND(Tabla1[[#This Row],[Haberes \nmensuales]]/Tabla1[[#This Row],[Índice \nRIPTE]]*$G$12,2),0)","v":0},{"$f":"ROUND(Tabla1[[#This Row],[Haberes Actualizados]]/DAY(EOMONTH(Tabla1[[#This Row],[Mes Haberes]],0))*Tabla1[[#This Row],[Días \ntrabajados]],2)","v":0}]
[null,null,null,"2023-08-01",{"$f":"IFERROR((DATEDIF($F$12,MIN(EOMONTH(Tabla1[[#This Row],[Mes Haberes]],0),$F$13),\"d\")),0)-SUM($E$43:E133)","v":0},null,39326.69,{"$f":"IFERROR(ROUND(Tabla1[[#This Row],[Haberes \nmensuales]]/Tabla1[[#This Row],[Índice \nRIPTE]]*$G$12,2),0)","v":0},{"$f":"ROUND(Tabla1[[#This Row],[Haberes Actualizados]]/DAY(EOMONTH(Tabla1[[#This Row],[Mes Haberes]],0))*Tabla1[[#This Row],[Días \ntrabajados]],2)","v":0}]
[null,null,null,"2023-09-01",{"$f":"IFERROR((DATEDIF($F$12,MIN(EOMONTH(Tabla1[[#This Row],[Mes Haberes]],0),$F$13),\"d\")),0)-SUM($E$43:E134)","v":0},null,43045.75,{"$f":"IFERROR(ROUND(Tabla1[[#This Row],[Haberes \nmensuales]]/Tabla1[[#This Row],[Índice \nRIPTE]]*$G$12,2),0)","v":0},{"$f":"ROUND(Tabla1[[#This Row],[Haberes Actualizados]]/DAY(EOMONTH(Tabla1[[#This Row],[Mes Haberes]],0))*Tabla1[[#This Row],[Días \ntrabajados]],2)","v":0}]
[null,null,null,"2023-10-01",{"$f":"IFERROR((DATEDIF($F$12,MIN(EOMONTH(Tabla1[[#This Row],[Mes Haberes]],0),$F$13),\"d\")),0)-SUM($E$43:E135)","v":0},null,48087.89,{"$f":"IFERROR(ROUND(Tabla1[[#This Row],[Haberes \nmensuales]]/Tabla1[[#This Row],[Índice \nRIPTE]]*$G$12,2),0)","v":0},{"$f":"ROUND(Tabla1[[#This Row],[Haberes Actualizados]]/DAY(EOMONTH(Tabla1[[#This Row],[Mes Haberes]],0))*Tabla1[[#This Row],[Días \ntrabajados]],2)","v":0}]
[null,null,null,"2023-11-01",{"$f":"IFERROR((DATEDIF($F$12,MIN(EOMONTH(Tabla1[[#This Row],[Mes Haberes]],0),$F$13),\"d\")),0)-SUM($E$43:E136)","v":0},null,51102.400000000001,{"$f":"IFERROR(ROUND(Tabla1[[#This Row],[Haberes \nmensuales]]/Tabla1[[#This Row],[Índice \nRIPTE]]*$G$12,2),0)","v":0},{"$f":"ROUND(Tabla1[[#This Row],[Haberes Actualizados]]/DAY(EOMONTH(Tabla1[[#This Row],[Mes Haberes]],0))*Tabla1[[#This Row],[Días \ntrabajados]],2)","v":0}]
[null,null,null,"2023-12-01",{"$f":"IFERROR((DATEDIF($F$12,MIN(EOMONTH(Tabla1[[#This Row],[Mes Haberes]],0),$F$13),\"d\")),0)-SUM($E$43:E137)","v":0},null,55356.61,{"$f":"IFERROR(ROUND(Tabla1[[#This Row],[Haberes \nmensuales]]/Tabla1[[#This Row],[Índice \nRIPTE]]*$G$12,2),0)","v":0},{"$f":"ROUND(Tabla1[[#This Row],[Haberes Actualizados]]/DAY(EOMONTH(Tabla1[[#This Row],[Mes Haberes]],0))*Tabla1[[#This Row],[Días \ntrabajados]],2)","v":0}]
[null,null,null,"2024-01-01",{"$f":"IFERROR((DATEDIF($F$12,MIN(EOMONTH(Tabla1[[#This Row],[Mes Haberes]],0),$F$13),\"d\")),0)-SUM($E$43:E138)","v":0},null,{"$f":"IF(VLOOKUP(Tabla1[[#This Row],[Mes Haberes]],'Índice RIPTE'!C:E,3,FALSE)=0,\"índice no publicado\",VLOOKUP(Tabla1[[#This Row],[Mes Haberes]],'Índice RIPTE'!C:E,3,FALSE))","v":63468.76},{"$f":"IFERROR(ROUND(Tabla1[[#This Row],[Haberes \nmensuales]]/Tabla1[[#This Row],[Índice \nRIPTE]]*$G$12,2),0)","v":0},{"$f":"ROUND(Tabla1[[#This Row],[Haberes Actualizados]]/DAY(EOMONTH(Tabla1[[#This Row],[Mes Haberes]],0))*Tabla1[[#This Row],[Días \ntrabajados]],2)","v":0}]
[null,null,null,"2024-02-01",{"$f":"IFERROR((DATEDIF($F$12,MIN(EOMONTH(Tabla1[[#This Row],[Mes Haberes]],0),$F$13),\"d\")),0)-SUM($E$43:E139)","v":0},null,{"$f":"IF(VLOOKUP(Tabla1[[#This Row],[Mes Haberes]],'Índice RIPTE'!C:E,3,FALSE)=0,\"índice no publicado\",VLOOKUP(Tabla1[[#This Row],[Mes Haberes]],'Índice RIPTE'!C:E,3,FALSE))","v":70754.17},{"$f":"IFERROR(ROUND(Tabla1[[#This Row],[Haberes \nmensuales]]/Tabla1[[#This Row],[Índice \nRIPTE]]*$G$12,2),0)","v":0},{"$f":"ROUND(Tabla1[[#This Row],[Haberes Actualizados]]/DAY(EOMONTH(Tabla1[[#This Row],[Mes Haberes]],0))*Tabla1[[#This Row],[Días \ntrabajados]],2)","v":0}]
[null,null,null,"2024-03-01",{"$f":"IFERROR((DATEDIF($F$12,MIN(EOMONTH(Tabla1[[#This Row],[Mes Haberes]],0),$F$13),\"d\")),0)-SUM($E$43:E140)","v":0},null,{"$f":"IF(VLOOKUP(Tabla1[[#This Row],[Mes Haberes]],'Índice RIPTE'!C:E,3,FALSE)=0,\"índice no publicado\",VLOOKUP(Tabla1[[#This Row],[Mes Haberes]],'Índice RIPTE'!C:E,3,FALSE))","v":80678.570000000007},{"$f":"IFERROR(ROUND(Tabla1[[#This Row],[Haberes \nmensuales]]/Tabla1[[#This Row],[Índice \nRIPTE]]*$G$12,2),0)","v":0},{"$f":"ROUND(Tabla1[[#This Row],[Haberes Actualizados]]/DAY(EOMONTH(Tabla1[[#This Row],[Mes Haberes]],0))*Tabla1[[#This Row],[Días \ntrabajados]],2)","v":0}]
[null,null,null,"2024-04-01",{"$f":"IFERROR((DATEDIF($F$12,MIN(EOMONTH(Tabla1[[#This Row],[Mes Haberes]],0),$F$13),\"d\")),0)-SUM($E$43:E141)","v":0},null,{"$f":"IF(VLOOKUP(Tabla1[[#This Row],[Mes Haberes]],'Índice RIPTE'!C:E,3,FALSE)=0,\"índice no publicado\",VLOOKUP(Tabla1[[#This Row],[Mes Haberes]],'Índice RIPTE'!C:E,3,FALSE))","v":93671.26},{"$f":"IFERROR(ROUND(Tabla1[[#This Row],[Haberes \nmensuales]]/Tabla1[[#This Row],[Índice \nRIPTE]]*$G$12,2),0)","v":0},{"$f":"ROUND(Tabla1[[#This Row],[Haberes Actualizados]]/DAY(EOMONTH(Tabla1[[#This Row],[Mes Haberes]],0))*Tabla1[[#This Row],[Días \ntrabajados]],2)","v":0}]
[null,null,null,"2024-05-01",{"$f":"IFERROR((DATEDIF($F$12,MIN(EOMONTH(Tabla1[[#This Row],[Mes Haberes]],0),$F$13),\"d\")),0)-SUM($E$43:E142)","v":0},null,{"$f":"IF(VLOOKUP(Tabla1[[#This Row],[Mes Haberes]],'Índice RIPTE'!C:E,3,FALSE)=0,\"índice no publicado\",VLOOKUP(Tabla1[[#This Row],[Mes Haberes]],'Índice RIPTE'!C:E,3,FALSE))","v":100527.29},{"$f":"IFERROR(ROUND(Tabla1[[#This Row],[Haberes \nmensuales]]/Tabla1[[#This Row],[Índice \nRIPTE]]*$G$12,2),0)","v":0},{"$f":"ROUND(Tabla1[[#This Row],[Haberes Actualizados]]/DAY(EOMONTH(Tabla1[[#This Row],[Mes Haberes]],0))*Tabla1[[#This Row],[Días \ntrabajados]],2)","v":0}]
[null,null,null,"2024-06-01",{"$f":"IFERROR((DATEDIF($F$12,MIN(EOMONTH(Tabla1[[#This Row],[Mes Haberes]],0),$F$13),\"d\")),0)-SUM($E$43:E143)","v":0},null,{"$f":"IF(VLOOKUP(Tabla1[[#This Row],[Mes Haberes]],'Índice RIPTE'!C:E,3,FALSE)=0,\"índice no publicado\",VLOOKUP(Tabla1[[#This Row],[Mes Haberes]],'Índice RIPTE'!C:E,3,FALSE))","v":106664.97},{"$f":"IFERROR(ROUND(Tabla1[[#This Row],[Haberes \nmensuales]]/Tabla1[[#This Row],[Índice \nRIPTE]]*$G$12,2),0)","v":0},{"$f":"ROUND(Tabla1[[#This Row],[Haberes Actualizados]]/DAY(EOMONTH(Tabla1[[#This Row],[Mes Haberes]],0))*Tabla1[[#This Row],[Días \ntrabajados]],2)","v":0}]
[null,null,null,"2024-07-01",{"$f":"IFERROR((DATEDIF($F$12,MIN(EOMONTH(Tabla1[[#This Row],[Mes Haberes]],0),$F$13),\"d\")),0)-SUM($E$43:E144)","v":0},null,{"$f":"IF(VLOOKUP(Tabla1[[#This Row],[Mes Haberes]],'Índice RIPTE'!C:E,3,FALSE)=0,\"índice no publicado\",VLOOKUP(Tabla1[[#This Row],[Mes Haberes]],'Índice RIPTE'!C:E,3,FALSE))","v":113694.76},{"$f":"IFERROR(ROUND(Tabla1[[#This Row],[Haberes \nmensuales]]/Tabla1[[#This Row],[Índice \nRIPTE]]*$G$12,2),0)","v":0},{"$f":"ROUND(Tabla1[[#This Row],[Haberes Actualizados]]/DAY(EOMONTH(Tabla1[[#This Row],[Mes Haberes]],0))*Tabla1[[#This Row],[Días \ntrabajados]],2)","v":0}]
[null,null,null,"2024-08-01",{"$f":"IFERROR((DATEDIF($F$12,MIN(EOMONTH(Tabla1[[#This Row],[Mes Haberes]],0),$F$13),\"d\")),0)-SUM($E$43:E145)","v":0},null,{"$f":"IF(VLOOKUP(Tabla1[[#This Row],[Mes Haberes]],'Índice RIPTE'!C:E,3,FALSE)=0,\"índice no publicado\",VLOOKUP(Tabla1[[#This Row],[Mes Haberes]],'Índice RIPTE'!C:E,3,FALSE))","v":118007.3},{"$f":"IFERROR(ROUND(Tabla1[[#This Row],[Haberes \nmensuales]]/Tabla1[[#This Row],[Índice \nRIPTE]]*$G$12,2),0)","v":0},{"$f":"ROUND(Tabla1[[#This Row],[Haberes Actualizados]]/DAY(EOMONTH(Tabla1[[#This Row],[Mes Haberes]],0))*Tabla1[[#This Row],[Días \ntrabajados]],2)","v":0}]
[null,null,null,"2024-09-01",{"$f":"IFERROR((DATEDIF($F$12,MIN(EOMONTH(Tabla1[[#This Row],[Mes Haberes]],0),$F$13),\"d\")),0)-SUM($E$43:E146)","v":0},null,{"$f":"IF(VLOOKUP(Tabla1[[#This Row],[Mes Haberes]],'Índice RIPTE'!C:E,3,FALSE)=0,\"índice no publicado\",VLOOKUP(Tabla1[[#This Row],[Mes Haberes]],'Índice RIPTE'!C:E,3,FALSE))","v":122891.98},{"$f":"IFERROR(ROUND(Tabla1[[#This Row],[Haberes \nmensuales]]/Tabla1[[#This Row],[Índice \nRIPTE]]*$G$12,2),0)","v":0},{"$f":"ROUND(Tabla1[[#This Row],[Haberes Actualizados]]/DAY(EOMONTH(Tabla1[[#This Row],[Mes Haberes]],0))*Tabla1[[#This Row],[Días \ntrabajados]],2)","v":0}]
[null,null,null,"2024-10-01",{"$f":"IFERROR((DATEDIF($F$12,MIN(EOMONTH(Tabla1[[#This Row],[Mes Haberes]],0),$F$13),\"d\")),0)-SUM($E$43:E147)","v":0},null,{"$f":"IF(VLOOKUP(Tabla1[[#This Row],[Mes Haberes]],'Índice RIPTE'!C:E,3,FALSE)=0,\"índice no publicado\",VLOOKUP(Tabla1[[#This Row],[Mes Haberes]],'Índice RIPTE'!C:E,3,FALSE))","v":131045.09},{"$f":"IFERROR(ROUND(Tabla1[[#This Row],[Haberes \nmensuales]]/Tabla1[[#This Row],[Índice \nRIPTE]]*$G$12,2),0)","v":0},{"$f":"ROUND(Tabla1[[#This Row],[Haberes Actualizados]]/DAY(EOMONTH(Tabla1[[#This Row],[Mes Haberes]],0))*Tabla1[[#This Row],[Días \ntrabajados]],2)","v":0}]
[null,null,null,"2024-11-01",{"$f":"IFERROR((DATEDIF($F$12,MIN(EOMONTH(Tabla1[[#This Row],[Mes Haberes]],0),$F$13),\"d\")),0)-SUM($E$43:E148)","v":0},null,{"$f":"IF(VLOOKUP(Tabla1[[#This Row],[Mes Haberes]],'Índice RIPTE'!C:E,3,FALSE)=0,\"índice no publicado\",VLOOKUP(Tabla1[[#This Row],[Mes Haberes]],'Índice RIPTE'!C:E,3,FALSE))","v":134754.34},{"$f":"IFERROR(ROUND(Tabla1[[#This Row],[Haberes \nmensuales]]/Tabla1[[#This Row],[Índice \nRIPTE]]*$G$12,2),0)","v":0},{"$f":"ROUND(Tabla1[[#This Row],[Haberes Actualizados]]/DAY(EOMONTH(Tabla1[[#This Row],[Mes Haberes]],0))*Tabla1[[#This Row],[Días \ntrabajados]],2)","v":0}]
[null,null,null,"2024-12-01",{"$f":"IFERROR((DATEDIF($F$12,MIN(EOMONTH(Tabla1[[#This Row],[Mes Haberes]],0),$F$13),\"d\")),0)-SUM($E$43:E149)","v":0},null,{"$f":"IF(VLOOKUP(Tabla1[[#This Row],[Mes Haberes]],'Índice RIPTE'!C:E,3,FALSE)=0,\"índice no publicado\",VLOOKUP(Tabla1[[#This Row],[Mes Haberes]],'Índice RIPTE'!C:E,3,FALSE))","v":137497.9},{"$f":"IFERROR(ROUND(Tabla1[[#This Row],[Haberes \nmensuales]]/Tabla1[[#This Row],[Índice \nRIPTE]]*$G$12,2),0)","v":0},{"$f":"ROUND(Tabla1[[#This Row],[Haberes Actualizados]]/DAY(EOMONTH(Tabla1[[#This Row],[Mes Haberes]],0))*Tabla1[[#This Row],[Días \ntrabajados]],2)","v":0}]
[null,null,null,"2025-01-01",{"$f":"IFERROR((DATEDIF($F$12,MIN(EOMONTH(Tabla1[[#This Row],[Mes Haberes]],0),$F$13),\"d\")),0)-SUM($E$43:E150)","v":0},null,{"$f":"IF(VLOOKUP(Tabla1[[#This Row],[Mes Haberes]],'Índice RIPTE'!C:E,3,FALSE)=0,\"índice no publicado\",VLOOKUP(Tabla1[[#This Row],[Mes Haberes]],'Índice RIPTE'!C:E,3,FALSE))","v":141124.78},{"$f":"IFERROR(ROUND(Tabla1[[#This Row],[Haberes \nmensuales]]/Tabla1[[#This Row],[Índice \nRIPTE]]*$G$12,2),0)","v":0},{"$f":"ROUND(Tabla1[[#This Row],[Haberes Actualizados]]/DAY(EOMONTH(Tabla1[[#This Row],[Mes Haberes]],0))*Tabla1[[#This Row],[Días \ntrabajados]],2)","v":0}]
[null,null,null,"2025-02-01",{"$f":"IFERROR((DATEDIF($F$12,MIN(EOMONTH(Tabla1[[#This Row],[Mes Haberes]],0),$F$13),\"d\")),0)-SUM($E$43:E151)","v":0},null,{"$f":"IF(VLOOKUP(Tabla1[[#This Row],[Mes Haberes]],'Índice RIPTE'!C:E,3,FALSE)=0,\"índice no publicado\",VLOOKUP(Tabla1[[#This Row],[Mes Haberes]],'Índice RIPTE'!C:E,3,FALSE))","v":149777.43},{"$f":"IFERROR(ROUND(Tabla1[[#This Row],[Haberes \nmensuales]]/Tabla1[[#This Row],[Índice \nRIPTE]]*$G$12,2),0)","v":0},{"$f":"ROUND(Tabla1[[#This Row],[Haberes Actualizados]]/DAY(EOMONTH(Tabla1[[#This Row],[Mes Haberes]],0))*Tabla1[[#This Row],[Días \ntrabajados]],2)","v":0}]
[null,null,null,"2025-03-01",{"$f":"IFERROR((DATEDIF($F$12,MIN(EOMONTH(Tabla1[[#This Row],[Mes Haberes]],0),$F$13),\"d\")),0)-SUM($E$43:E152)","v":0},null,{"$f":"IF(VLOOKUP(Tabla1[[#This Row],[Mes Haberes]],'Índice RIPTE'!C:E,3,FALSE)=0,\"índice no publicado\",VLOOKUP(Tabla1[[#This Row],[Mes Haberes]],'Índice RIPTE'!C:E,3,FALSE))","v":155852.91},{"$f":"IFERROR(ROUND(Tabla1[[#This Row],[Haberes \nmensuales]]/Tabla1[[#This Row],[Índice \nRIPTE]]*$G$12,2),0)","v":0},{"$f":"ROUND(Tabla1[[#This Row],[Haberes Actualizados]]/DAY(EOMONTH(Tabla1[[#This Row],[Mes Haberes]],0))*Tabla1[[#This Row],[Días \ntrabajados]],2)","v":0}]
[null,null,null,"2025-04-01",{"$f":"IFERROR((DATEDIF($F$12,MIN(EOMONTH(Tabla1[[#This Row],[Mes Haberes]],0),$F$13),\"d\")),0)-SUM($E$43:E153)","v":0},null,{"$f":"IF(VLOOKUP(Tabla1[[#This Row],[Mes Haberes]],'Índice RIPTE'!C:E,3,FALSE)=0,\"índice no publicado\",VLOOKUP(Tabla1[[#This Row],[Mes Haberes]],'Índice RIPTE'!C:E,3,FALSE))","v":160321.72},{"$f":"IFERROR(ROUND(Tabla1[[#This Row],[Haberes \nmensuales]]/Tabla1[[#This Row],[Índice \nRIPTE]]*$G$12,2),0)","v":0},{"$f":"ROUND(Tabla1[[#This Row],[Haberes Actualizados]]/DAY(EOMONTH(Tabla1[[#This Row],[Mes Haberes]],0))*Tabla1[[#This Row],[Días \ntrabajados]],2)","v":0}]
[null,null,null,"2025-05-01",{"$f":"IFERROR((DATEDIF($F$12,MIN(EOMONTH(Tabla1[[#This Row],[Mes Haberes]],0),$F$13),\"d\")),0)-SUM($E$43:E154)","v":0},null,{"$f":"IF(VLOOKUP(Tabla1[[#This Row],[Mes Haberes]],'Índice RIPTE'!C:E,3,FALSE)=0,\"índice no publicado\",VLOOKUP(Tabla1[[#This Row],[Mes Haberes]],'Índice RIPTE'!C:E,3,FALSE))","v":163299.84},{"$f":"IFERROR(ROUND(Tabla1[[#This Row],[Haberes \nmensuales]]/Tabla1[[#This Row],[Índice \nRIPTE]]*$G$12,2),0)","v":0},{"$f":"ROUND(Tabla1[[#This Row],[Haberes Actualizados]]/DAY(EOMONTH(Tabla1[[#This Row],[Mes Haberes]],0))*Tabla1[[#This Row],[Días \ntrabajados]],2)","v":0}]
[null,null,null,"2025-06-01",{"$f":"IFERROR((DATEDIF($F$12,MIN(EOMONTH(Tabla1[[#This Row],[Mes Haberes]],0),$F$13),\"d\")),0)-SUM($E$43:E155)","v":0},null,{"$f":"IF(VLOOKUP(Tabla1[[#This Row],[Mes Haberes]],'Índice RIPTE'!C:E,3,FALSE)=0,\"índice no publicado\",VLOOKUP(Tabla1[[#This Row],[Mes Haberes]],'Índice RIPTE'!C:E,3,FALSE))","v":167811.87},{"$f":"IFERROR(ROUND(Tabla1[[#This Row],[Haberes \nmensuales]]/Tabla1[[#This Row],[Índice \nRIPTE]]*$G$12,2),0)","v":0},{"$f":"ROUND(Tabla1[[#This Row],[Haberes Actualizados]]/DAY(EOMONTH(Tabla1[[#This Row],[Mes Haberes]],0))*Tabla1[[#This Row],[Días \ntrabajados]],2)","v":0}]
[null,null,null,"2025-07-01",{"$f":"IFERROR((DATEDIF($F$12,MIN(EOMONTH(Tabla1[[#This Row],[Mes Haberes]],0),$F$13),\"d\")),0)-SUM($E$43:E156)","v":0},null,{"$f":"IF(VLOOKUP(Tabla1[[#This Row],[Mes Haberes]],'Índice RIPTE'!C:E,3,FALSE)=0,\"índice no publicado\",VLOOKUP(Tabla1[[#This Row],[Mes Haberes]],'Índice RIPTE'!C:E,3,FALSE))","v":172674.89},{"$f":"IFERROR(ROUND(Tabla1[[#This Row],[Haberes \nmensuales]]/Tabla1[[#This Row],[Índice \nRIPTE]]*$G$12,2),0)","v":0},{"$f":"ROUND(Tabla1[[#This Row],[Haberes Actualizados]]/DAY(EOMONTH(Tabla1[[#This Row],[Mes Haberes]],0))*Tabla1[[#This Row],[Días \ntrabajados]],2)","v":0}]
[null,null,null,"2025-08-01",{"$f":"IFERROR((DATEDIF($F$12,MIN(EOMONTH(Tabla1[[#This Row],[Mes Haberes]],0),$F$13),\"d\")),0)-SUM($E$43:E157)","v":0},null,{"$f":"IF(VLOOKUP(Tabla1[[#This Row],[Mes Haberes]],'Índice RIPTE'!C:E,3,FALSE)=0,\"índice no publicado\",VLOOKUP(Tabla1[[#This Row],[Mes Haberes]],'Índice RIPTE'!C:E,3,FALSE))","v":174917.11},{"$f":"IFERROR(ROUND(Tabla1[[#This Row],[Haberes \nmensuales]]/Tabla1[[#This Row],[Índice \nRIPTE]]*$G$12,2),0)","v":0},{"$f":"ROUND(Tabla1[[#This Row],[Haberes Actualizados]]/DAY(EOMONTH(Tabla1[[#This Row],[Mes Haberes]],0))*Tabla1[[#This Row],[Días \ntrabajados]],2)","v":0}]
[null,null,null,"2025-09-01",{"$f":"IFERROR((DATEDIF($F$12,MIN(EOMONTH(Tabla1[[#This Row],[Mes Haberes]],0),$F$13),\"d\")),0)-SUM($E$43:E158)","v":0},null,{"$f":"IF(VLOOKUP(Tabla1[[#This Row],[Mes Haberes]],'Índice RIPTE'!C:E,3,FALSE)=0,\"índice no publicado\",VLOOKUP(Tabla1[[#This Row],[Mes Haberes]],'Índice RIPTE'!C:E,3,FALSE))","v":177378.55},{"$f":"IFERROR(ROUND(Tabla1[[#This Row],[Haberes \nmensuales]]/Tabla1[[#This Row],[Índice \nRIPTE]]*$G$12,2),0)","v":0},{"$f":"ROUND(Tabla1[[#This Row],[Haberes Actualizados]]/DAY(EOMONTH(Tabla1[[#This Row],[Mes Haberes]],0))*Tabla1[[#This Row],[Días \ntrabajados]],2)","v":0}]
[null,null,null,"2025-10-01",{"$f":"IFERROR((DATEDIF($F$12,MIN(EOMONTH(Tabla1[[#This Row],[Mes Haberes]],0),$F$13),\"d\")),0)-SUM($E$43:E159)","v":0},null,{"$f":"IF(VLOOKUP(Tabla1[[#This Row],[Mes Haberes]],'Índice RIPTE'!C:E,3,FALSE)=0,\"índice no publicado\",VLOOKUP(Tabla1[[#This Row],[Mes Haberes]],'Índice RIPTE'!C:E,3,FALSE))","v":182089.61},{"$f":"IFERROR(ROUND(Tabla1[[#This Row],[Haberes \nmensuales]]/Tabla1[[#This Row],[Índice \nRIPTE]]*$G$12,2),0)","v":0},{"$f":"ROUND(Tabla1[[#This Row],[Haberes Actualizados]]/DAY(EOMONTH(Tabla1[[#This Row],[Mes Haberes]],0))*Tabla1[[#This Row],[Días \ntrabajados]],2)","v":0}]
[null,null,null,"2025-11-01",{"$f":"IFERROR((DATEDIF($F$12,MIN(EOMONTH(Tabla1[[#This Row],[Mes Haberes]],0),$F$13),\"d\")),0)-SUM($E$43:E160)","v":0},null,{"$f":"IF(VLOOKUP(Tabla1[[#This Row],[Mes Haberes]],'Índice RIPTE'!C:E,3,FALSE)=0,\"índice no publicado\",VLOOKUP(Tabla1[[#This Row],[Mes Haberes]],'Índice RIPTE'!C:E,3,FALSE))","v":184238.99},{"$f":"IFERROR(ROUND(Tabla1[[#This Row],[Haberes \nmensuales]]/Tabla1[[#This Row],[Índice \nRIPTE]]*$G$12,2),0)","v":0},{"$f":"ROUND(Tabla1[[#This Row],[Haberes Actualizados]]/DAY(EOMONTH(Tabla1[[#This Row],[Mes Haberes]],0))*Tabla1[[#This Row],[Días \ntrabajados]],2)","v":0}]
[null,null,null,"2025-12-01",{"$f":"IFERROR((DATEDIF($F$12,MIN(EOMONTH(Tabla1[[#This Row],[Mes Haberes]],0),$F$13),\"d\")),0)-SUM($E$43:E161)","v":0},null,{"$f":"IF(VLOOKUP(Tabla1[[#This Row],[Mes Haberes]],'Índice RIPTE'!C:E,3,FALSE)=0,\"índice no publicado\",VLOOKUP(Tabla1[[#This Row],[Mes Haberes]],'Índice RIPTE'!C:E,3,FALSE))","v":186718.83},{"$f":"IFERROR(ROUND(Tabla1[[#This Row],[Haberes \nmensuales]]/Tabla1[[#This Row],[Índice \nRIPTE]]*$G$12,2),0)","v":0},{"$f":"ROUND(Tabla1[[#This Row],[Haberes Actualizados]]/DAY(EOMONTH(Tabla1[[#This Row],[Mes Haberes]],0))*Tabla1[[#This Row],[Días \ntrabajados]],2)","v":0}]
[null,null,null,"2026-01-01",{"$f":"IFERROR((DATEDIF($F$12,MIN(EOMONTH(Tabla1[[#This Row],[Mes Haberes]],0),$F$13),\"d\")),0)-SUM($E$43:E162)","v":0},null,{"$f":"IF(VLOOKUP(Tabla1[[#This Row],[Mes Haberes]],'Índice RIPTE'!C:E,3,FALSE)=0,\"índice no publicado\",VLOOKUP(Tabla1[[#This Row],[Mes Haberes]],'Índice RIPTE'!C:E,3,FALSE))","v":188181.62},{"$f":"IFERROR(ROUND(Tabla1[[#This Row],[Haberes \nmensuales]]/Tabla1[[#This Row],[Índice \nRIPTE]]*$G$12,2),0)","v":0},{"$f":"ROUND(Tabla1[[#This Row],[Haberes Actualizados]]/DAY(EOMONTH(Tabla1[[#This Row],[Mes Haberes]],0))*Tabla1[[#This Row],[Días \ntrabajados]],2)","v":0}]
[null,null,null,"2026-02-01",{"$f":"IFERROR((DATEDIF($F$12,MIN(EOMONTH(Tabla1[[#This Row],[Mes Haberes]],0),$F$13),\"d\")),0)-SUM($E$43:E163)","v":0},null,{"$f":"IF(VLOOKUP(Tabla1[[#This Row],[Mes Haberes]],'Índice RIPTE'!C:E,3,FALSE)=0,\"índice no publicado\",VLOOKUP(Tabla1[[#This Row],[Mes Haberes]],'Índice RIPTE'!C:E,3,FALSE))","v":"índice no publicado"},{"$f":"IFERROR(ROUND(Tabla1[[#This Row],[Haberes \nmensuales]]/Tabla1[[#This Row],[Índice \nRIPTE]]*$G$12,2),0)","v":0},{"$f":"ROUND(Tabla1[[#This Row],[Haberes Actualizados]]/DAY(EOMONTH(Tabla1[[#This Row],[Mes Haberes]],0))*Tabla1[[#This Row],[Días \ntrabajados]],2)","v":0}]
[null,null,null,"2026-03-01",{"$f":"IFERROR((DATEDIF($F$12,MIN(EOMONTH(Tabla1[[#This Row],[Mes Haberes]],0),$F$13),\"d\")),0)-SUM($E$43:E164)","v":0},null,{"$f":"IF(VLOOKUP(Tabla1[[#This Row],[Mes Haberes]],'Índice RIPTE'!C:E,3,FALSE)=0,\"índice no publicado\",VLOOKUP(Tabla1[[#This Row],[Mes Haberes]],'Índice RIPTE'!C:E,3,FALSE))","v":"índice no publicado"},{"$f":"IFERROR(ROUND(Tabla1[[#This Row],[Haberes \nmensuales]]/Tabla1[[#This Row],[Índice \nRIPTE]]*$G$12,2),0)","v":0},{"$f":"ROUND(Tabla1[[#This Row],[Haberes Actualizados]]/DAY(EOMONTH(Tabla1[[#This Row],[Mes Haberes]],0))*Tabla1[[#This Row],[Días \ntrabajados]],2)","v":0}]
[null,null,null,"2026-04-01",{"$f":"IFERROR((DATEDIF($F$12,MIN(EOMONTH(Tabla1[[#This Row],[Mes Haberes]],0),$F$13),\"d\")),0)-SUM($E$43:E165)","v":0},null,{"$f":"IF(VLOOKUP(Tabla1[[#This Row],[Mes Haberes]],'Índice RIPTE'!C:E,3,FALSE)=0,\"índice no publicado\",VLOOKUP(Tabla1[[#This Row],[Mes Haberes]],'Índice RIPTE'!C:E,3,FALSE))","v":"índice no publicado"},{"$f":"IFERROR(ROUND(Tabla1[[#This Row],[Haberes \nmensuales]]/Tabla1[[#This Row],[Índice \nRIPTE]]*$G$12,2),0)","v":0},{"$f":"ROUND(Tabla1[[#This Row],[Haberes Actualizados]]/DAY(EOMONTH(Tabla1[[#This Row],[Mes Haberes]],0))*Tabla1[[#This Row],[Días \ntrabajados]],2)","v":0}]
[null,null,null,"2026-05-01",{"$f":"IFERROR((DATEDIF($F$12,MIN(EOMONTH(Tabla1[[#This Row],[Mes Haberes]],0),$F$13),\"d\")),0)-SUM($E$43:E166)","v":0},null,{"$f":"IF(VLOOKUP(Tabla1[[#This Row],[Mes Haberes]],'Índice RIPTE'!C:E,3,FALSE)=0,\"índice no publicado\",VLOOKUP(Tabla1[[#This Row],[Mes Haberes]],'Índice RIPTE'!C:E,3,FALSE))","v":"índice no publicado"},{"$f":"IFERROR(ROUND(Tabla1[[#This Row],[Haberes \nmensuales]]/Tabla1[[#This Row],[Índice \nRIPTE]]*$G$12,2),0)","v":0},{"$f":"ROUND(Tabla1[[#This Row],[Haberes Actualizados]]/DAY(EOMONTH(Tabla1[[#This Row],[Mes Haberes]],0))*Tabla1[[#This Row],[Días \ntrabajados]],2)","v":0}]
[null,null,null,"2026-06-01",{"$f":"IFERROR((DATEDIF($F$12,MIN(EOMONTH(Tabla1[[#This Row],[Mes Haberes]],0),$F$13),\"d\")),0)-SUM($E$43:E167)","v":0},null,{"$f":"IF(VLOOKUP(Tabla1[[#This Row],[Mes Haberes]],'Índice RIPTE'!C:E,3,FALSE)=0,\"índice no publicado\",VLOOKUP(Tabla1[[#This Row],[Mes Haberes]],'Índice RIPTE'!C:E,3,FALSE))","v":"índice no publicado"},{"$f":"IFERROR(ROUND(Tabla1[[#This Row],[Haberes \nmensuales]]/Tabla1[[#This Row],[Índice \nRIPTE]]*$G$12,2),0)","v":0},{"$f":"ROUND(Tabla1[[#This Row],[Haberes Actualizados]]/DAY(EOMONTH(Tabla1[[#This Row],[Mes Haberes]],0))*Tabla1[[#This Row],[Días \ntrabajados]],2)","v":0}]
[null,null,null,"2026-07-01",{"$f":"IFERROR((DATEDIF($F$12,MIN(EOMONTH(Tabla1[[#This Row],[Mes Haberes]],0),$F$13),\"d\")),0)-SUM($E$43:E168)","v":0},null,{"$f":"IF(VLOOKUP(Tabla1[[#This Row],[Mes Haberes]],'Índice RIPTE'!C:E,3,FALSE)=0,\"índice no publicado\",VLOOKUP(Tabla1[[#This Row],[Mes Haberes]],'Índice RIPTE'!C:E,3,FALSE))","v":"índice no publicado"},{"$f":"IFERROR(ROUND(Tabla1[[#This Row],[Haberes \nmensuales]]/Tabla1[[#This Row],[Índice \nRIPTE]]*$G$12,2),0)","v":0},{"$f":"ROUND(Tabla1[[#This Row],[Haberes Actualizados]]/DAY(EOMONTH(Tabla1[[#This Row],[Mes Haberes]],0))*Tabla1[[#This Row],[Días \ntrabajados]],2)","v":0}]
[null,null,null,"2026-08-01",{"$f":"IFERROR((DATEDIF($F$12,MIN(EOMONTH(Tabla1[[#This Row],[Mes Haberes]],0),$F$13),\"d\")),0)-SUM($E$43:E169)","v":0},null,{"$f":"IF(VLOOKUP(Tabla1[[#This Row],[Mes Haberes]],'Índice RIPTE'!C:E,3,FALSE)=0,\"índice no publicado\",VLOOKUP(Tabla1[[#This Row],[Mes Haberes]],'Índice RIPTE'!C:E,3,FALSE))","v":"índice no publicado"},{"$f":"IFERROR(ROUND(Tabla1[[#This Row],[Haberes \nmensuales]]/Tabla1[[#This Row],[Índice \nRIPTE]]*$G$12,2),0)","v":0},{"$f":"ROUND(Tabla1[[#This Row],[Haberes Actualizados]]/DAY(EOMONTH(Tabla1[[#This Row],[Mes Haberes]],0))*Tabla1[[#This Row],[Días \ntrabajados]],2)","v":0}]
[null,null,null,"2026-09-01",{"$f":"IFERROR((DATEDIF($F$12,MIN(EOMONTH(Tabla1[[#This Row],[Mes Haberes]],0),$F$13),\"d\")),0)-SUM($E$43:E170)","v":0},null,{"$f":"IF(VLOOKUP(Tabla1[[#This Row],[Mes Haberes]],'Índice RIPTE'!C:E,3,FALSE)=0,\"índice no publicado\",VLOOKUP(Tabla1[[#This Row],[Mes Haberes]],'Índice RIPTE'!C:E,3,FALSE))","v":"índice no publicado"},{"$f":"IFERROR(ROUND(Tabla1[[#This Row],[Haberes \nmensuales]]/Tabla1[[#This Row],[Índice \nRIPTE]]*$G$12,2),0)","v":0},{"$f":"ROUND(Tabla1[[#This Row],[Haberes Actualizados]]/DAY(EOMONTH(Tabla1[[#This Row],[Mes Haberes]],0))*Tabla1[[#This Row],[Días \ntrabajados]],2)","v":0}]
[null,null,null,"2026-10-01",{"$f":"IFERROR((DATEDIF($F$12,MIN(EOMONTH(Tabla1[[#This Row],[Mes Haberes]],0),$F$13),\"d\")),0)-SUM($E$43:E171)","v":0},null,{"$f":"IF(VLOOKUP(Tabla1[[#This Row],[Mes Haberes]],'Índice RIPTE'!C:E,3,FALSE)=0,\"índice no publicado\",VLOOKUP(Tabla1[[#This Row],[Mes Haberes]],'Índice RIPTE'!C:E,3,FALSE))","v":"índice no publicado"},{"$f":"IFERROR(ROUND(Tabla1[[#This Row],[Haberes \nmensuales]]/Tabla1[[#This Row],[Índice \nRIPTE]]*$G$12,2),0)","v":0},{"$f":"ROUND(Tabla1[[#This Row],[Haberes Actualizados]]/DAY(EOMONTH(Tabla1[[#This Row],[Mes Haberes]],0))*Tabla1[[#This Row],[Días \ntrabajados]],2)","v":0}]
[null,null,null,"2026-11-01",{"$f":"IFERROR((DATEDIF($F$12,MIN(EOMONTH(Tabla1[[#This Row],[Mes Haberes]],0),$F$13),\"d\")),0)-SUM($E$43:E172)","v":0},null,{"$f":"IF(VLOOKUP(Tabla1[[#This Row],[Mes Haberes]],'Índice RIPTE'!C:E,3,FALSE)=0,\"índice no publicado\",VLOOKUP(Tabla1[[#This Row],[Mes Haberes]],'Índice RIPTE'!C:E,3,FALSE))","v":"índice no publicado"},{"$f":"IFERROR(ROUND(Tabla1[[#This Row],[Haberes \nmensuales]]/Tabla1[[#This Row],[Índice \nRIPTE]]*$G$12,2),0)","v":0},{"$f":"ROUND(Tabla1[[#This Row],[Haberes Actualizados]]/DAY(EOMONTH(Tabla1[[#This Row],[Mes Haberes]],0))*Tabla1[[#This Row],[Días \ntrabajados]],2)","v":0}]
[null,null,null,"2026-12-01",{"$f":"IFERROR((DATEDIF($F$12,MIN(EOMONTH(Tabla1[[#This Row],[Mes Haberes]],0),$F$13),\"d\")),0)-SUM($E$43:E173)","v":0},null,{"$f":"IF(VLOOKUP(Tabla1[[#This Row],[Mes Haberes]],'Índice RIPTE'!C:E,3,FALSE)=0,\"índice no publicado\",VLOOKUP(Tabla1[[#This Row],[Mes Haberes]],'Índice RIPTE'!C:E,3,FALSE))","v":"índice no publicado"},{"$f":"IFERROR(ROUND(Tabla1[[#This Row],[Haberes \nmensuales]]/Tabla1[[#This Row],[Índice \nRIPTE]]*$G$12,2),0)","v":0},{"$f":"ROUND(Tabla1[[#This Row],[Haberes Actualizados]]/DAY(EOMONTH(Tabla1[[#This Row],[Mes Haberes]],0))*Tabla1[[#This Row],[Días \ntrabajados]],2)","v":0}]
[]
[]
[null,null,null,"Detalle de cálculo: Tasa de interés RIPTE (art. 12 inc. 2 LRT)"]
[]
[null,null,null,"Mes Intereses","Índice \nRIPTE","Índice RIPTE computable","% var. \nÍndice RIPTE computable","Dias de \nintereses","Tasa de interés computable"]
[null,null,null,"2016-01-01",1808.6,null,null,{"$f":"IFERROR(IF($F$9>(EOMONTH(Tabla2[[#This Row],[Mes Intereses]],0)),(MIN(DATEDIF($F$7-1,EOMONTH(Tabla2[[#This Row],[Mes Intereses]],0),\"d\"),DAY(EOMONTH(D180,0)))),DATEDIF(MAX($F$7,Tabla2[[#This Row],[Mes Intereses]]),$F$9+1,\"d\")),0)","v":0},{"$f":"ROUND(Tabla2[[#This Row],[% var. \nÍndice RIPTE computable]]/DAY(EOMONTH(Tabla2[[#This Row],[Mes Intereses]],0))*Tabla2[[#This Row],[Dias de \nintereses]],4)","v":0}]
[null,null,null,"2016-02-01",1888.34,null,null,{"$f":"IFERROR(IF($F$9>(EOMONTH(Tabla2[[#This Row],[Mes Intereses]],0)),(MIN(DATEDIF($F$7-1,EOMONTH(Tabla2[[#This Row],[Mes Intereses]],0),\"d\"),DAY(EOMONTH(D181,0)))),DATEDIF(MAX($F$7,Tabla2[[#This Row],[Mes Intereses]]),$F$9+1,\"d\")),0)","v":0},{"$f":"ROUND(Tabla2[[#This Row],[% var. \nÍndice RIPTE computable]]/DAY(EOMONTH(Tabla2[[#This Row],[Mes Intereses]],0))*Tabla2[[#This Row],[Dias de \nintereses]],4)","v":0}]
[null,null,null,"2016-03-01",1940.55,null,null,{"$f":"IFERROR(IF($F$9>(EOMONTH(Tabla2[[#This Row],[Mes Intereses]],0)),(MIN(DATEDIF($F$7-1,EOMONTH(Tabla2[[#This Row],[Mes Intereses]],0),\"d\"),DAY(EOMONTH(D182,0)))),DATEDIF(MAX($F$7,Tabla2[[#This Row],[Mes Intereses]]),$F$9+1,\"d\")),0)","v":0},{"$f":"ROUND(Tabla2[[#This Row],[% var. \nÍndice RIPTE computable]]/DAY(EOMONTH(Tabla2[[#This Row],[Mes Intereses]],0))*Tabla2[[#This Row],[Dias de \nintereses]],4)","v":0}]
[null,null,null,"2016-04-01",2022.16,{"$f":"+E180","v":1808.6},null,{"$f":"IFERROR(IF($F$9>(EOMONTH(Tabla2[[#This Row],[Mes Intereses]],0)),(MIN(DATEDIF($F$7-1,EOMONTH(Tabla2[[#This Row],[Mes Intereses]],0),\"d\"),DAY(EOMONTH(D183,0)))),DATEDIF(MAX($F$7,Tabla2[[#This Row],[Mes Intereses]]),$F$9+1,\"d\")),0)","v":0},{"$f":"ROUND(Tabla2[[#This Row],[% var. \nÍndice RIPTE computable]]/DAY(EOMONTH(Tabla2[[#This Row],[Mes Intereses]],0))*Tabla2[[#This Row],[Dias de \nintereses]],4)","v":0}]
[null,null,null,"2016-05-01",2062.33,{"$f":"+E181","v":1888.34},{"$f":"ROUND(Tabla2[[#This Row],[Índice RIPTE computable]]/F183-1,4)","v":4.41E-2},{"$f":"IFERROR(IF($F$9>(EOMONTH(Tabla2[[#This Row],[Mes Intereses]],0)),(MIN(DATEDIF($F$7-1,EOMONTH(Tabla2[[#This Row],[Mes Intereses]],0),\"d\"),DAY(EOMONTH(D184,0)))),DATEDIF(MAX($F$7,Tabla2[[#This Row],[Mes Intereses]]),$F$9+1,\"d\")),0)","v":0},{"$f":"ROUND(Tabla2[[#This Row],[% var. \nÍndice RIPTE computable]]/DAY(EOMONTH(Tabla2[[#This Row],[Mes Intereses]],0))*Tabla2[[#This Row],[Dias de \nintereses]],4)","v":0}]
[null,null,null,"2016-06-01",2089.1799999999998,1940.55,{"$f":"ROUND(Tabla2[[#This Row],[Índice RIPTE computable]]/F184-1,4)","v":2.76E-2},{"$f":"IFERROR(IF($F$9>(EOMONTH(Tabla2[[#This Row],[Mes Intereses]],0)),(MIN(DATEDIF($F$7-1,EOMONTH(Tabla2[[#This Row],[Mes Intereses]],0),\"d\"),DAY(EOMONTH(D185,0)))),DATEDIF(MAX($F$7,Tabla2[[#This Row],[Mes Intereses]]),$F$9+1,\"d\")),0)","v":0},{"$f":"ROUND(Tabla2[[#This Row],[% var. \nÍndice RIPTE computable]]/DAY(EOMONTH(Tabla2[[#This Row],[Mes Intereses]],0))*Tabla2[[#This Row],[Dias de \nintereses]],4)","v":0}]
[null,null,null,"2016-07-01",2170.4299999999998,2022.16,{"$f":"ROUND(Tabla2[[#This Row],[Índice RIPTE computable]]/F185-1,4)","v":4.2099999999999999E-2},{"$f":"IFERROR(IF($F$9>(EOMONTH(Tabla2[[#This Row],[Mes Intereses]],0)),(MIN(DATEDIF($F$7-1,EOMONTH(Tabla2[[#This Row],[Mes Intereses]],0),\"d\"),DAY(EOMONTH(D186,0)))),DATEDIF(MAX($F$7,Tabla2[[#This Row],[Mes Intereses]]),$F$9+1,\"d\")),0)","v":0},{"$f":"ROUND(Tabla2[[#This Row],[% var. \nÍndice RIPTE computable]]/DAY(EOMONTH(Tabla2[[#This Row],[Mes Intereses]],0))*Tabla2[[#This Row],[Dias de \nintereses]],4)","v":0}]
[null,null,null,"2016-08-01",2196.5300000000002,2062.33,{"$f":"ROUND(Tabla2[[#This Row],[Índice RIPTE computable]]/F186-1,4)","v":1.9900000000000001E-2},{"$f":"IFERROR(IF($F$9>(EOMONTH(Tabla2[[#This Row],[Mes Intereses]],0)),(MIN(DATEDIF($F$7-1,EOMONTH(Tabla2[[#This Row],[Mes Intereses]],0),\"d\"),DAY(EOMONTH(D187,0)))),DATEDIF(MAX($F$7,Tabla2[[#This Row],[Mes Intereses]]),$F$9+1,\"d\")),0)","v":0},{"$f":"ROUND(Tabla2[[#This Row],[% var. \nÍndice RIPTE computable]]/DAY(EOMONTH(Tabla2[[#This Row],[Mes Intereses]],0))*Tabla2[[#This Row],[Dias de \nintereses]],4)","v":0}]
[null,null,null,"2016-09-01",2247.9299999999998,2089.1799999999998,{"$f":"ROUND(Tabla2[[#This Row],[Índice RIPTE computable]]/F187-1,4)","v":1.2999999999999999E-2},{"$f":"IFERROR(IF($F$9>(EOMONTH(Tabla2[[#This Row],[Mes Intereses]],0)),(MIN(DATEDIF($F$7-1,EOMONTH(Tabla2[[#This Row],[Mes Intereses]],0),\"d\"),DAY(EOMONTH(D188,0)))),DATEDIF(MAX($F$7,Tabla2[[#This Row],[Mes Intereses]]),$F$9+1,\"d\")),0)","v":0},{"$f":"ROUND(Tabla2[[#This Row],[% var. \nÍndice RIPTE computable]]/DAY(EOMONTH(Tabla2[[#This Row],[Mes Intereses]],0))*Tabla2[[#This Row],[Dias de \nintereses]],4)","v":0}]
[null,null,null,"2016-10-01",2293.9699999999998,2170.4299999999998,{"$f":"ROUND(Tabla2[[#This Row],[Índice RIPTE computable]]/F188-1,4)","v":3.8899999999999997E-2},{"$f":"IFERROR(IF($F$9>(EOMONTH(Tabla2[[#This Row],[Mes Intereses]],0)),(MIN(DATEDIF($F$7-1,EOMONTH(Tabla2[[#This Row],[Mes Intereses]],0),\"d\"),DAY(EOMONTH(D189,0)))),DATEDIF(MAX($F$7,Tabla2[[#This Row],[Mes Intereses]]),$F$9+1,\"d\")),0)","v":0},{"$f":"ROUND(Tabla2[[#This Row],[% var. \nÍndice RIPTE computable]]/DAY(EOMONTH(Tabla2[[#This Row],[Mes Intereses]],0))*Tabla2[[#This Row],[Dias de \nintereses]],4)","v":0}]
[null,null,null,"2016-11-01",2334.36,2196.5300000000002,{"$f":"ROUND(Tabla2[[#This Row],[Índice RIPTE computable]]/F189-1,4)","v":1.2E-2},{"$f":"IFERROR(IF($F$9>(EOMONTH(Tabla2[[#This Row],[Mes Intereses]],0)),(MIN(DATEDIF($F$7-1,EOMONTH(Tabla2[[#This Row],[Mes Intereses]],0),\"d\"),DAY(EOMONTH(D190,0)))),DATEDIF(MAX($F$7,Tabla2[[#This Row],[Mes Intereses]]),$F$9+1,\"d\")),0)","v":0},{"$f":"ROUND(Tabla2[[#This Row],[% var. \nÍndice RIPTE computable]]/DAY(EOMONTH(Tabla2[[#This Row],[Mes Intereses]],0))*Tabla2[[#This Row],[Dias de \nintereses]],4)","v":0}]
[null,null,null,"2016-12-01",2364.94,2247.9299999999998,{"$f":"ROUND(Tabla2[[#This Row],[Índice RIPTE computable]]/F190-1,4)","v":2.3400000000000001E-2},{"$f":"IFERROR(IF($F$9>(EOMONTH(Tabla2[[#This Row],[Mes Intereses]],0)),(MIN(DATEDIF($F$7-1,EOMONTH(Tabla2[[#This Row],[Mes Intereses]],0),\"d\"),DAY(EOMONTH(D191,0)))),DATEDIF(MAX($F$7,Tabla2[[#This Row],[Mes Intereses]]),$F$9+1,\"d\")),0)","v":0},{"$f":"ROUND(Tabla2[[#This Row],[% var. \nÍndice RIPTE computable]]/DAY(EOMONTH(Tabla2[[#This Row],[Mes Intereses]],0))*Tabla2[[#This Row],[Dias de \nintereses]],4)","v":0}]
[null,null,null,"2017-01-01",2405.87,2293.9699999999998,{"$f":"ROUND(Tabla2[[#This Row],[Índice RIPTE computable]]/F191-1,4)","v":2.0500000000000001E-2},{"$f":"IFERROR(IF($F$9>(EOMONTH(Tabla2[[#This Row],[Mes Intereses]],0)),(MIN(DATEDIF($F$7-1,EOMONTH(Tabla2[[#This Row],[Mes Intereses]],0),\"d\"),DAY(EOMONTH(D192,0)))),DATEDIF(MAX($F$7,Tabla2[[#This Row],[Mes Intereses]]),$F$9+1,\"d\")),0)","v":0},{"$f":"ROUND(Tabla2[[#This Row],[% var. \nÍndice RIPTE computable]]/DAY(EOMONTH(Tabla2[[#This Row],[Mes Intereses]],0))*Tabla2[[#This Row],[Dias de \nintereses]],4)","v":0}]
[null,null,null,"2017-02-01",2455.5700000000002,2334.36,{"$f":"ROUND(Tabla2[[#This Row],[Índice RIPTE computable]]/F192-1,4)","v":1.7600000000000001E-2},{"$f":"IFERROR(IF($F$9>(EOMONTH(Tabla2[[#This Row],[Mes Intereses]],0)),(MIN(DATEDIF($F$7-1,EOMONTH(Tabla2[[#This Row],[Mes Intereses]],0),\"d\"),DAY(EOMONTH(D193,0)))),DATEDIF(MAX($F$7,Tabla2[[#This Row],[Mes Intereses]]),$F$9+1,\"d\")),0)","v":0},{"$f":"ROUND(Tabla2[[#This Row],[% var. \nÍndice RIPTE computable]]/DAY(EOMONTH(Tabla2[[#This Row],[Mes Intereses]],0))*Tabla2[[#This Row],[Dias de \nintereses]],4)","v":0}]
[null,null,null,"2017-03-01",2547.29,2364.94,{"$f":"ROUND(Tabla2[[#This Row],[Índice RIPTE computable]]/F193-1,4)","v":1.3100000000000001E-2},{"$f":"IFERROR(IF($F$9>(EOMONTH(Tabla2[[#This Row],[Mes Intereses]],0)),(MIN(DATEDIF($F$7-1,EOMONTH(Tabla2[[#This Row],[Mes Intereses]],0),\"d\"),DAY(EOMONTH(D194,0)))),DATEDIF(MAX($F$7,Tabla2[[#This Row],[Mes Intereses]]),$F$9+1,\"d\")),0)","v":0},{"$f":"ROUND(Tabla2[[#This Row],[% var. \nÍndice RIPTE computable]]/DAY(EOMONTH(Tabla2[[#This Row],[Mes Intereses]],0))*Tabla2[[#This Row],[Dias de \nintereses]],4)","v":0}]
[null,null,null,"2017-04-01",2589.02,2405.87,{"$f":"ROUND(Tabla2[[#This Row],[Índice RIPTE computable]]/F194-1,4)","v":1.7299999999999999E-2},{"$f":"IFERROR(IF($F$9>(EOMONTH(Tabla2[[#This Row],[Mes Intereses]],0)),(MIN(DATEDIF($F$7-1,EOMONTH(Tabla2[[#This Row],[Mes Intereses]],0),\"d\"),DAY(EOMONTH(D195,0)))),DATEDIF(MAX($F$7,Tabla2[[#This Row],[Mes Intereses]]),$F$9+1,\"d\")),0)","v":0},{"$f":"ROUND(Tabla2[[#This Row],[% var. \nÍndice RIPTE computable]]/DAY(EOMONTH(Tabla2[[#This Row],[Mes Intereses]],0))*Tabla2[[#This Row],[Dias de \nintereses]],4)","v":0}]
[null,null,null,"2017-05-01",2632.39,2455.5700000000002,{"$f":"ROUND(Tabla2[[#This Row],[Índice RIPTE computable]]/F195-1,4)","v":2.07E-2},{"$f":"IFERROR(IF($F$9>(EOMONTH(Tabla2[[#This Row],[Mes Intereses]],0)),(MIN(DATEDIF($F$7-1,EOMONTH(Tabla2[[#This Row],[Mes Intereses]],0),\"d\"),DAY(EOMONTH(D196,0)))),DATEDIF(MAX($F$7,Tabla2[[#This Row],[Mes Intereses]]),$F$9+1,\"d\")),0)","v":0},{"$f":"ROUND(Tabla2[[#This Row],[% var. \nÍndice RIPTE computable]]/DAY(EOMONTH(Tabla2[[#This Row],[Mes Intereses]],0))*Tabla2[[#This Row],[Dias de \nintereses]],4)","v":0}]
[null,null,null,"2017-06-01",2682.68,2547.29,{"$f":"ROUND(Tabla2[[#This Row],[Índice RIPTE computable]]/F196-1,4)","v":3.7400000000000003E-2},{"$f":"IFERROR(IF($F$9>(EOMONTH(Tabla2[[#This Row],[Mes Intereses]],0)),(MIN(DATEDIF($F$7-1,EOMONTH(Tabla2[[#This Row],[Mes Intereses]],0),\"d\"),DAY(EOMONTH(D197,0)))),DATEDIF(MAX($F$7,Tabla2[[#This Row],[Mes Intereses]]),$F$9+1,\"d\")),0)","v":0},{"$f":"ROUND(Tabla2[[#This Row],[% var. \nÍndice RIPTE computable]]/DAY(EOMONTH(Tabla2[[#This Row],[Mes Intereses]],0))*Tabla2[[#This Row],[Dias de \nintereses]],4)","v":0}]
[null,null,null,"2017-07-01",2799.18,2589.02,{"$f":"ROUND(Tabla2[[#This Row],[Índice RIPTE computable]]/F197-1,4)","v":1.6400000000000001E-2},{"$f":"IFERROR(IF($F$9>(EOMONTH(Tabla2[[#This Row],[Mes Intereses]],0)),(MIN(DATEDIF($F$7-1,EOMONTH(Tabla2[[#This Row],[Mes Intereses]],0),\"d\"),DAY(EOMONTH(D198,0)))),DATEDIF(MAX($F$7,Tabla2[[#This Row],[Mes Intereses]]),$F$9+1,\"d\")),0)","v":0},{"$f":"ROUND(Tabla2[[#This Row],[% var. \nÍndice RIPTE computable]]/DAY(EOMONTH(Tabla2[[#This Row],[Mes Intereses]],0))*Tabla2[[#This Row],[Dias de \nintereses]],4)","v":0}]
[null,null,null,"2017-08-01",2823.33,2632.39,{"$f":"ROUND(Tabla2[[#This Row],[Índice RIPTE computable]]/F198-1,4)","v":1.6799999999999999E-2},{"$f":"IFERROR(IF($F$9>(EOMONTH(Tabla2[[#This Row],[Mes Intereses]],0)),(MIN(DATEDIF($F$7-1,EOMONTH(Tabla2[[#This Row],[Mes Intereses]],0),\"d\"),DAY(EOMONTH(D199,0)))),DATEDIF(MAX($F$7,Tabla2[[#This Row],[Mes Intereses]]),$F$9+1,\"d\")),0)","v":0},{"$f":"ROUND(Tabla2[[#This Row],[% var. \nÍndice RIPTE computable]]/DAY(EOMONTH(Tabla2[[#This Row],[Mes Intereses]],0))*Tabla2[[#This Row],[Dias de \nintereses]],4)","v":0}]
[null,null,null,"2017-09-01",2873.15,2682.68,{"$f":"ROUND(Tabla2[[#This Row],[Índice RIPTE computable]]/F199-1,4)","v":1.9099999999999999E-2},{"$f":"IFERROR(IF($F$9>(EOMONTH(Tabla2[[#This Row],[Mes Intereses]],0)),(MIN(DATEDIF($F$7-1,EOMONTH(Tabla2[[#This Row],[Mes Intereses]],0),\"d\"),DAY(EOMONTH(D200,0)))),DATEDIF(MAX($F$7,Tabla2[[#This Row],[Mes Intereses]]),$F$9+1,\"d\")),0)","v":0},{"$f":"ROUND(Tabla2[[#This Row],[% var. \nÍndice RIPTE computable]]/DAY(EOMONTH(Tabla2[[#This Row],[Mes Intereses]],0))*Tabla2[[#This Row],[Dias de \nintereses]],4)","v":0}]
[null,null,null,"2017-10-01",2953.98,2799.18,{"$f":"ROUND(Tabla2[[#This Row],[Índice RIPTE computable]]/F200-1,4)","v":4.3400000000000001E-2},{"$f":"IFERROR(IF($F$9>(EOMONTH(Tabla2[[#This Row],[Mes Intereses]],0)),(MIN(DATEDIF($F$7-1,EOMONTH(Tabla2[[#This Row],[Mes Intereses]],0),\"d\"),DAY(EOMONTH(D201,0)))),DATEDIF(MAX($F$7,Tabla2[[#This Row],[Mes Intereses]]),$F$9+1,\"d\")),0)","v":0},{"$f":"ROUND(Tabla2[[#This Row],[% var. \nÍndice RIPTE computable]]/DAY(EOMONTH(Tabla2[[#This Row],[Mes Intereses]],0))*Tabla2[[#This Row],[Dias de \nintereses]],4)","v":0}]
[null,null,null,"2017-11-01",2992.14,2823.33,{"$f":"ROUND(Tabla2[[#This Row],[Índice RIPTE computable]]/F201-1,4)","v":8.6E-3},{"$f":"IFERROR(IF($F$9>(EOMONTH(Tabla2[[#This Row],[Mes Intereses]],0)),(MIN(DATEDIF($F$7-1,EOMONTH(Tabla2[[#This Row],[Mes Intereses]],0),\"d\"),DAY(EOMONTH(D202,0)))),DATEDIF(MAX($F$7,Tabla2[[#This Row],[Mes Intereses]]),$F$9+1,\"d\")),0)","v":0},{"$f":"ROUND(Tabla2[[#This Row],[% var. \nÍndice RIPTE computable]]/DAY(EOMONTH(Tabla2[[#This Row],[Mes Intereses]],0))*Tabla2[[#This Row],[Dias de \nintereses]],4)","v":0}]
[null,null,null,"2017-12-01",3006.32,2873.15,{"$f":"ROUND(Tabla2[[#This Row],[Índice RIPTE computable]]/F202-1,4)","v":1.7600000000000001E-2},{"$f":"IFERROR(IF($F$9>(EOMONTH(Tabla2[[#This Row],[Mes Intereses]],0)),(MIN(DATEDIF($F$7-1,EOMONTH(Tabla2[[#This Row],[Mes Intereses]],0),\"d\"),DAY(EOMONTH(D203,0)))),DATEDIF(MAX($F$7,Tabla2[[#This Row],[Mes Intereses]]),$F$9+1,\"d\")),0)","v":0},{"$f":"ROUND(Tabla2[[#This Row],[% var. \nÍndice RIPTE computable]]/DAY(EOMONTH(Tabla2[[#This Row],[Mes Intereses]],0))*Tabla2[[#This Row],[Dias de \nintereses]],4)","v":0}]
[null,null,null,"2018-01-01",3078.15,2953.98,{"$f":"ROUND(Tabla2[[#This Row],[Índice RIPTE computable]]/F203-1,4)","v":2.81E-2},{"$f":"IFERROR(IF($F$9>(EOMONTH(Tabla2[[#This Row],[Mes Intereses]],0)),(MIN(DATEDIF($F$7-1,EOMONTH(Tabla2[[#This Row],[Mes Intereses]],0),\"d\"),DAY(EOMONTH(D204,0)))),DATEDIF(MAX($F$7,Tabla2[[#This Row],[Mes Intereses]]),$F$9+1,\"d\")),0)","v":0},{"$f":"ROUND(Tabla2[[#This Row],[% var. \nÍndice RIPTE computable]]/DAY(EOMONTH(Tabla2[[#This Row],[Mes Intereses]],0))*Tabla2[[#This Row],[Dias de \nintereses]],4)","v":0}]
[null,null,null,"2018-02-01",3136.49,2992.14,{"$f":"ROUND(Tabla2[[#This Row],[Índice RIPTE computable]]/F204-1,4)","v":1.29E-2},{"$f":"IFERROR(IF($F$9>(EOMONTH(Tabla2[[#This Row],[Mes Intereses]],0)),(MIN(DATEDIF($F$7-1,EOMONTH(Tabla2[[#This Row],[Mes Intereses]],0),\"d\"),DAY(EOMONTH(D205,0)))),DATEDIF(MAX($F$7,Tabla2[[#This Row],[Mes Intereses]]),$F$9+1,\"d\")),0)","v":0},{"$f":"ROUND(Tabla2[[#This Row],[% var. \nÍndice RIPTE computable]]/DAY(EOMONTH(Tabla2[[#This Row],[Mes Intereses]],0))*Tabla2[[#This Row],[Dias de \nintereses]],4)","v":0}]
[null,null,null,"2018-03-01",3208.74,3006.32,{"$f":"ROUND(Tabla2[[#This Row],[Índice RIPTE computable]]/F205-1,4)","v":4.7000000000000002E-3},{"$f":"IFERROR(IF($F$9>(EOMONTH(Tabla2[[#This Row],[Mes Intereses]],0)),(MIN(DATEDIF($F$7-1,EOMONTH(Tabla2[[#This Row],[Mes Intereses]],0),\"d\"),DAY(EOMONTH(D206,0)))),DATEDIF(MAX($F$7,Tabla2[[#This Row],[Mes Intereses]]),$F$9+1,\"d\")),0)","v":0},{"$f":"ROUND(Tabla2[[#This Row],[% var. \nÍndice RIPTE computable]]/DAY(EOMONTH(Tabla2[[#This Row],[Mes Intereses]],0))*Tabla2[[#This Row],[Dias de \nintereses]],4)","v":0}]
[null,null,null,"2018-04-01",3298.55,3078.15,{"$f":"ROUND(Tabla2[[#This Row],[Índice RIPTE computable]]/F206-1,4)","v":2.3900000000000001E-2},{"$f":"IFERROR(IF($F$9>(EOMONTH(Tabla2[[#This Row],[Mes Intereses]],0)),(MIN(DATEDIF($F$7-1,EOMONTH(Tabla2[[#This Row],[Mes Intereses]],0),\"d\"),DAY(EOMONTH(D207,0)))),DATEDIF(MAX($F$7,Tabla2[[#This Row],[Mes Intereses]]),$F$9+1,\"d\")),0)","v":0},{"$f":"ROUND(Tabla2[[#This Row],[% var. \nÍndice RIPTE computable]]/DAY(EOMONTH(Tabla2[[#This Row],[Mes Intereses]],0))*Tabla2[[#This Row],[Dias de \nintereses]],4)","v":0}]
[null,null,null,"2018-05-01",3353.5,3136.49,{"$f":"ROUND(Tabla2[[#This Row],[Índice RIPTE computable]]/F207-1,4)","v":1.9E-2},{"$f":"IFERROR(IF($F$9>(EOMONTH(Tabla2[[#This Row],[Mes Intereses]],0)),(MIN(DATEDIF($F$7-1,EOMONTH(Tabla2[[#This Row],[Mes Intereses]],0),\"d\"),DAY(EOMONTH(D208,0)))),DATEDIF(MAX($F$7,Tabla2[[#This Row],[Mes Intereses]]),$F$9+1,\"d\")),0)","v":0},{"$f":"ROUND(Tabla2[[#This Row],[% var. \nÍndice RIPTE computable]]/DAY(EOMONTH(Tabla2[[#This Row],[Mes Intereses]],0))*Tabla2[[#This Row],[Dias de \nintereses]],4)","v":0}]
[null,null,null,"2018-06-01",3383.14,3208.74,{"$f":"ROUND(Tabla2[[#This Row],[Índice RIPTE computable]]/F208-1,4)","v":2.3E-2},{"$f":"IFERROR(IF($F$9>(EOMONTH(Tabla2[[#This Row],[Mes Intereses]],0)),(MIN(DATEDIF($F$7-1,EOMONTH(Tabla2[[#This Row],[Mes Intereses]],0),\"d\"),DAY(EOMONTH(D209,0)))),DATEDIF(MAX($F$7,Tabla2[[#This Row],[Mes Intereses]]),$F$9+1,\"d\")),0)","v":0},{"$f":"ROUND(Tabla2[[#This Row],[% var. \nÍndice RIPTE computable]]/DAY(EOMONTH(Tabla2[[#This Row],[Mes Intereses]],0))*Tabla2[[#This Row],[Dias de \nintereses]],4)","v":0}]
[null,null,null,"2018-07-01",3461.52,3298.55,{"$f":"ROUND(Tabla2[[#This Row],[Índice RIPTE computable]]/F209-1,4)","v":2.8000000000000001E-2},{"$f":"IFERROR(IF($F$9>(EOMONTH(Tabla2[[#This Row],[Mes Intereses]],0)),(MIN(DATEDIF($F$7-1,EOMONTH(Tabla2[[#This Row],[Mes Intereses]],0),\"d\"),DAY(EOMONTH(D210,0)))),DATEDIF(MAX($F$7,Tabla2[[#This Row],[Mes Intereses]]),$F$9+1,\"d\")),0)","v":0},{"$f":"ROUND(Tabla2[[#This Row],[% var. \nÍndice RIPTE computable]]/DAY(EOMONTH(Tabla2[[#This Row],[Mes Intereses]],0))*Tabla2[[#This Row],[Dias de \nintereses]],4)","v":0}]
[null,null,null,"2018-08-01",3540.95,3353.5,{"$f":"ROUND(Tabla2[[#This Row],[Índice RIPTE computable]]/F210-1,4)","v":1.67E-2},{"$f":"IFERROR(IF($F$9>(EOMONTH(Tabla2[[#This Row],[Mes Intereses]],0)),(MIN(DATEDIF($F$7-1,EOMONTH(Tabla2[[#This Row],[Mes Intereses]],0),\"d\"),DAY(EOMONTH(D211,0)))),DATEDIF(MAX($F$7,Tabla2[[#This Row],[Mes Intereses]]),$F$9+1,\"d\")),0)","v":0},{"$f":"ROUND(Tabla2[[#This Row],[% var. \nÍndice RIPTE computable]]/DAY(EOMONTH(Tabla2[[#This Row],[Mes Intereses]],0))*Tabla2[[#This Row],[Dias de \nintereses]],4)","v":0}]
[null,null,null,"2018-09-01",3603.23,3383.14,{"$f":"ROUND(Tabla2[[#This Row],[Índice RIPTE computable]]/F211-1,4)","v":8.8000000000000005E-3},{"$f":"IFERROR(IF($F$9>(EOMONTH(Tabla2[[#This Row],[Mes Intereses]],0)),(MIN(DATEDIF($F$7-1,EOMONTH(Tabla2[[#This Row],[Mes Intereses]],0),\"d\"),DAY(EOMONTH(D212,0)))),DATEDIF(MAX($F$7,Tabla2[[#This Row],[Mes Intereses]]),$F$9+1,\"d\")),0)","v":0},{"$f":"ROUND(Tabla2[[#This Row],[% var. \nÍndice RIPTE computable]]/DAY(EOMONTH(Tabla2[[#This Row],[Mes Intereses]],0))*Tabla2[[#This Row],[Dias de \nintereses]],4)","v":0}]
[null,null,null,"2018-10-01",3789.62,3461.52,{"$f":"ROUND(Tabla2[[#This Row],[Índice RIPTE computable]]/F212-1,4)","v":2.3199999999999998E-2},{"$f":"IFERROR(IF($F$9>(EOMONTH(Tabla2[[#This Row],[Mes Intereses]],0)),(MIN(DATEDIF($F$7-1,EOMONTH(Tabla2[[#This Row],[Mes Intereses]],0),\"d\"),DAY(EOMONTH(D213,0)))),DATEDIF(MAX($F$7,Tabla2[[#This Row],[Mes Intereses]]),$F$9+1,\"d\")),0)","v":0},{"$f":"ROUND(Tabla2[[#This Row],[% var. \nÍndice RIPTE computable]]/DAY(EOMONTH(Tabla2[[#This Row],[Mes Intereses]],0))*Tabla2[[#This Row],[Dias de \nintereses]],4)","v":0}]
[null,null,null,"2018-11-01",3855.86,3540.95,{"$f":"ROUND(Tabla2[[#This Row],[Índice RIPTE computable]]/F213-1,4)","v":2.29E-2},{"$f":"IFERROR(IF($F$9>(EOMONTH(Tabla2[[#This Row],[Mes Intereses]],0)),(MIN(DATEDIF($F$7-1,EOMONTH(Tabla2[[#This Row],[Mes Intereses]],0),\"d\"),DAY(EOMONTH(D214,0)))),DATEDIF(MAX($F$7,Tabla2[[#This Row],[Mes Intereses]]),$F$9+1,\"d\")),0)","v":0},{"$f":"ROUND(Tabla2[[#This Row],[% var. \nÍndice RIPTE computable]]/DAY(EOMONTH(Tabla2[[#This Row],[Mes Intereses]],0))*Tabla2[[#This Row],[Dias de \nintereses]],4)","v":0}]
[null,null,null,"2018-12-01",3925.11,3603.23,{"$f":"ROUND(Tabla2[[#This Row],[Índice RIPTE computable]]/F214-1,4)","v":1.7600000000000001E-2},{"$f":"IFERROR(IF($F$9>(EOMONTH(Tabla2[[#This Row],[Mes Intereses]],0)),(MIN(DATEDIF($F$7-1,EOMONTH(Tabla2[[#This Row],[Mes Intereses]],0),\"d\"),DAY(EOMONTH(D215,0)))),DATEDIF(MAX($F$7,Tabla2[[#This Row],[Mes Intereses]]),$F$9+1,\"d\")),0)","v":0},{"$f":"ROUND(Tabla2[[#This Row],[% var. \nÍndice RIPTE computable]]/DAY(EOMONTH(Tabla2[[#This Row],[Mes Intereses]],0))*Tabla2[[#This Row],[Dias de \nintereses]],4)","v":0}]
[null,null,null,"2019-01-01",4042,3789.62,{"$f":"ROUND(Tabla2[[#This Row],[Índice RIPTE computable]]/F215-1,4)","v":5.1700000000000003E-2},{"$f":"IFERROR(IF($F$9>(EOMONTH(Tabla2[[#This Row],[Mes Intereses]],0)),(MIN(DATEDIF($F$7-1,EOMONTH(Tabla2[[#This Row],[Mes Intereses]],0),\"d\"),DAY(EOMONTH(D216,0)))),DATEDIF(MAX($F$7,Tabla2[[#This Row],[Mes Intereses]]),$F$9+1,\"d\")),0)","v":0},{"$f":"ROUND(Tabla2[[#This Row],[% var. \nÍndice RIPTE computable]]/DAY(EOMONTH(Tabla2[[#This Row],[Mes Intereses]],0))*Tabla2[[#This Row],[Dias de \nintereses]],4)","v":0}]
[null,null,null,"2019-02-01",4198.76,3855.86,{"$f":"ROUND(Tabla2[[#This Row],[Índice RIPTE computable]]/F216-1,4)","v":1.7500000000000002E-2},{"$f":"IFERROR(IF($F$9>(EOMONTH(Tabla2[[#This Row],[Mes Intereses]],0)),(MIN(DATEDIF($F$7-1,EOMONTH(Tabla2[[#This Row],[Mes Intereses]],0),\"d\"),DAY(EOMONTH(D217,0)))),DATEDIF(MAX($F$7,Tabla2[[#This Row],[Mes Intereses]]),$F$9+1,\"d\")),0)","v":0},{"$f":"ROUND(Tabla2[[#This Row],[% var. \nÍndice RIPTE computable]]/DAY(EOMONTH(Tabla2[[#This Row],[Mes Intereses]],0))*Tabla2[[#This Row],[Dias de \nintereses]],4)","v":0}]
[null,null,null,"2019-03-01",4444.6000000000004,3925.11,{"$f":"ROUND(Tabla2[[#This Row],[Índice RIPTE computable]]/F217-1,4)","v":1.7999999999999999E-2},{"$f":"IFERROR(IF($F$9>(EOMONTH(Tabla2[[#This Row],[Mes Intereses]],0)),(MIN(DATEDIF($F$7-1,EOMONTH(Tabla2[[#This Row],[Mes Intereses]],0),\"d\"),DAY(EOMONTH(D218,0)))),DATEDIF(MAX($F$7,Tabla2[[#This Row],[Mes Intereses]]),$F$9+1,\"d\")),0)","v":0},{"$f":"ROUND(Tabla2[[#This Row],[% var. \nÍndice RIPTE computable]]/DAY(EOMONTH(Tabla2[[#This Row],[Mes Intereses]],0))*Tabla2[[#This Row],[Dias de \nintereses]],4)","v":0}]
[null,null,null,"2019-04-01",4533.03,4042,{"$f":"ROUND(Tabla2[[#This Row],[Índice RIPTE computable]]/F218-1,4)","v":2.98E-2},{"$f":"IFERROR(IF($F$9>(EOMONTH(Tabla2[[#This Row],[Mes Intereses]],0)),(MIN(DATEDIF($F$7-1,EOMONTH(Tabla2[[#This Row],[Mes Intereses]],0),\"d\"),DAY(EOMONTH(D219,0)))),DATEDIF(MAX($F$7,Tabla2[[#This Row],[Mes Intereses]]),$F$9+1,\"d\")),0)","v":0},{"$f":"ROUND(Tabla2[[#This Row],[% var. \nÍndice RIPTE computable]]/DAY(EOMONTH(Tabla2[[#This Row],[Mes Intereses]],0))*Tabla2[[#This Row],[Dias de \nintereses]],4)","v":0}]
[null,null,null,"2019-05-01",4676.25,4198.76,{"$f":"ROUND(Tabla2[[#This Row],[Índice RIPTE computable]]/F219-1,4)","v":3.8800000000000001E-2},{"$f":"IFERROR(IF($F$9>(EOMONTH(Tabla2[[#This Row],[Mes Intereses]],0)),(MIN(DATEDIF($F$7-1,EOMONTH(Tabla2[[#This Row],[Mes Intereses]],0),\"d\"),DAY(EOMONTH(D220,0)))),DATEDIF(MAX($F$7,Tabla2[[#This Row],[Mes Intereses]]),$F$9+1,\"d\")),0)","v":0},{"$f":"ROUND(Tabla2[[#This Row],[% var. \nÍndice RIPTE computable]]/DAY(EOMONTH(Tabla2[[#This Row],[Mes Intereses]],0))*Tabla2[[#This Row],[Dias de \nintereses]],4)","v":0}]
[null,null,null,"2019-06-01",4753.1899999999996,4444.6000000000004,{"$f":"ROUND(Tabla2[[#This Row],[Índice RIPTE computable]]/F220-1,4)","v":5.8599999999999999E-2},{"$f":"IFERROR(IF($F$9>(EOMONTH(Tabla2[[#This Row],[Mes Intereses]],0)),(MIN(DATEDIF($F$7-1,EOMONTH(Tabla2[[#This Row],[Mes Intereses]],0),\"d\"),DAY(EOMONTH(D221,0)))),DATEDIF(MAX($F$7,Tabla2[[#This Row],[Mes Intereses]]),$F$9+1,\"d\")),0)","v":0},{"$f":"ROUND(Tabla2[[#This Row],[% var. \nÍndice RIPTE computable]]/DAY(EOMONTH(Tabla2[[#This Row],[Mes Intereses]],0))*Tabla2[[#This Row],[Dias de \nintereses]],4)","v":0}]
[null,null,null,"2019-07-01",4948.2700000000004,4533.03,{"$f":"ROUND(Tabla2[[#This Row],[Índice RIPTE computable]]/F221-1,4)","v":1.9900000000000001E-2},{"$f":"IFERROR(IF($F$9>(EOMONTH(Tabla2[[#This Row],[Mes Intereses]],0)),(MIN(DATEDIF($F$7-1,EOMONTH(Tabla2[[#This Row],[Mes Intereses]],0),\"d\"),DAY(EOMONTH(D222,0)))),DATEDIF(MAX($F$7,Tabla2[[#This Row],[Mes Intereses]]),$F$9+1,\"d\")),0)","v":0},{"$f":"ROUND(Tabla2[[#This Row],[% var. \nÍndice RIPTE computable]]/DAY(EOMONTH(Tabla2[[#This Row],[Mes Intereses]],0))*Tabla2[[#This Row],[Dias de \nintereses]],4)","v":0}]
[null,null,null,"2019-08-01",5039.93,4676.25,{"$f":"ROUND(Tabla2[[#This Row],[Índice RIPTE computable]]/F222-1,4)","v":3.1600000000000003E-2},{"$f":"IFERROR(IF($F$9>(EOMONTH(Tabla2[[#This Row],[Mes Intereses]],0)),(MIN(DATEDIF($F$7-1,EOMONTH(Tabla2[[#This Row],[Mes Intereses]],0),\"d\"),DAY(EOMONTH(D223,0)))),DATEDIF(MAX($F$7,Tabla2[[#This Row],[Mes Intereses]]),$F$9+1,\"d\")),0)","v":0},{"$f":"ROUND(Tabla2[[#This Row],[% var. \nÍndice RIPTE computable]]/DAY(EOMONTH(Tabla2[[#This Row],[Mes Intereses]],0))*Tabla2[[#This Row],[Dias de \nintereses]],4)","v":0}]
[null,null,null,"2019-09-01",5199.08,4753.1899999999996,{"$f":"ROUND(Tabla2[[#This Row],[Índice RIPTE computable]]/F223-1,4)","v":1.6500000000000001E-2},{"$f":"IFERROR(IF($F$9>(EOMONTH(Tabla2[[#This Row],[Mes Intereses]],0)),(MIN(DATEDIF($F$7-1,EOMONTH(Tabla2[[#This Row],[Mes Intereses]],0),\"d\"),DAY(EOMONTH(D224,0)))),DATEDIF(MAX($F$7,Tabla2[[#This Row],[Mes Intereses]]),$F$9+1,\"d\")),0)","v":0},{"$f":"ROUND(Tabla2[[#This Row],[% var. \nÍndice RIPTE computable]]/DAY(EOMONTH(Tabla2[[#This Row],[Mes Intereses]],0))*Tabla2[[#This Row],[Dias de \nintereses]],4)","v":0}]
[null,null,null,"2019-10-01",5467.59,4948.2700000000004,{"$f":"ROUND(Tabla2[[#This Row],[Índice RIPTE computable]]/F224-1,4)","v":4.1000000000000002E-2},{"$f":"IFERROR(IF($F$9>(EOMONTH(Tabla2[[#This Row],[Mes Intereses]],0)),(MIN(DATEDIF($F$7-1,EOMONTH(Tabla2[[#This Row],[Mes Intereses]],0),\"d\"),DAY(EOMONTH(D225,0)))),DATEDIF(MAX($F$7,Tabla2[[#This Row],[Mes Intereses]]),$F$9+1,\"d\")),0)","v":0},{"$f":"ROUND(Tabla2[[#This Row],[% var. \nÍndice RIPTE computable]]/DAY(EOMONTH(Tabla2[[#This Row],[Mes Intereses]],0))*Tabla2[[#This Row],[Dias de \nintereses]],4)","v":0}]
[null,null,null,"2019-11-01",5554.15,5039.93,{"$f":"ROUND(Tabla2[[#This Row],[Índice RIPTE computable]]/F225-1,4)","v":1.8499999999999999E-2},{"$f":"IFERROR(IF($F$9>(EOMONTH(Tabla2[[#This Row],[Mes Intereses]],0)),(MIN(DATEDIF($F$7-1,EOMONTH(Tabla2[[#This Row],[Mes Intereses]],0),\"d\"),DAY(EOMONTH(D226,0)))),DATEDIF(MAX($F$7,Tabla2[[#This Row],[Mes Intereses]]),$F$9+1,\"d\")),0)","v":0},{"$f":"ROUND(Tabla2[[#This Row],[% var. \nÍndice RIPTE computable]]/DAY(EOMONTH(Tabla2[[#This Row],[Mes Intereses]],0))*Tabla2[[#This Row],[Dias de \nintereses]],4)","v":0}]
[null,null,null,"2019-12-01",5666.48,5199.08,{"$f":"ROUND(Tabla2[[#This Row],[Índice RIPTE computable]]/F226-1,4)","v":3.1600000000000003E-2},{"$f":"IFERROR(IF($F$9>(EOMONTH(Tabla2[[#This Row],[Mes Intereses]],0)),(MIN(DATEDIF($F$7-1,EOMONTH(Tabla2[[#This Row],[Mes Intereses]],0),\"d\"),DAY(EOMONTH(D227,0)))),DATEDIF(MAX($F$7,Tabla2[[#This Row],[Mes Intereses]]),$F$9+1,\"d\")),0)","v":0},{"$f":"ROUND(Tabla2[[#This Row],[% var. \nÍndice RIPTE computable]]/DAY(EOMONTH(Tabla2[[#This Row],[Mes Intereses]],0))*Tabla2[[#This Row],[Dias de \nintereses]],4)","v":0}]
[null,null,null,"2020-01-01",6066.07,5467.59,{"$f":"ROUND(Tabla2[[#This Row],[Índice RIPTE computable]]/F227-1,4)","v":5.16E-2},{"$f":"IFERROR(IF($F$9>(EOMONTH(Tabla2[[#This Row],[Mes Intereses]],0)),(MIN(DATEDIF($F$7-1,EOMONTH(Tabla2[[#This Row],[Mes Intereses]],0),\"d\"),DAY(EOMONTH(D228,0)))),DATEDIF(MAX($F$7,Tabla2[[#This Row],[Mes Intereses]]),$F$9+1,\"d\")),0)","v":0},{"$f":"ROUND(Tabla2[[#This Row],[% var. \nÍndice RIPTE computable]]/DAY(EOMONTH(Tabla2[[#This Row],[Mes Intereses]],0))*Tabla2[[#This Row],[Dias de \nintereses]],4)","v":0}]
[null,null,null,"2020-02-01",6445.13,5554.15,{"$f":"ROUND(Tabla2[[#This Row],[Índice RIPTE computable]]/F228-1,4)","v":1.5800000000000002E-2},{"$f":"IFERROR(IF($F$9>(EOMONTH(Tabla2[[#This Row],[Mes Intereses]],0)),(MIN(DATEDIF($F$7-1,EOMONTH(Tabla2[[#This Row],[Mes Intereses]],0),\"d\"),DAY(EOMONTH(D229,0)))),DATEDIF(MAX($F$7,Tabla2[[#This Row],[Mes Intereses]]),$F$9+1,\"d\")),0)","v":0},{"$f":"ROUND(Tabla2[[#This Row],[% var. \nÍndice RIPTE computable]]/DAY(EOMONTH(Tabla2[[#This Row],[Mes Intereses]],0))*Tabla2[[#This Row],[Dias de \nintereses]],4)","v":0}]
[null,null,null,"2020-03-01",6500.72,5666.48,{"$f":"ROUND(Tabla2[[#This Row],[Índice RIPTE computable]]/F229-1,4)","v":2.0199999999999999E-2},{"$f":"IFERROR(IF($F$9>(EOMONTH(Tabla2[[#This Row],[Mes Intereses]],0)),(MIN(DATEDIF($F$7-1,EOMONTH(Tabla2[[#This Row],[Mes Intereses]],0),\"d\"),DAY(EOMONTH(D230,0)))),DATEDIF(MAX($F$7,Tabla2[[#This Row],[Mes Intereses]]),$F$9+1,\"d\")),0)","v":0},{"$f":"ROUND(Tabla2[[#This Row],[% var. \nÍndice RIPTE computable]]/DAY(EOMONTH(Tabla2[[#This Row],[Mes Intereses]],0))*Tabla2[[#This Row],[Dias de \nintereses]],4)","v":0}]
[null,null,null,"2020-04-01",6510.18,6066.07,{"$f":"ROUND(Tabla2[[#This Row],[Índice RIPTE computable]]/F230-1,4)","v":7.0499999999999993E-2},{"$f":"IFERROR(IF($F$9>(EOMONTH(Tabla2[[#This Row],[Mes Intereses]],0)),(MIN(DATEDIF($F$7-1,EOMONTH(Tabla2[[#This Row],[Mes Intereses]],0),\"d\"),DAY(EOMONTH(D231,0)))),DATEDIF(MAX($F$7,Tabla2[[#This Row],[Mes Intereses]]),$F$9+1,\"d\")),0)","v":0},{"$f":"ROUND(Tabla2[[#This Row],[% var. \nÍndice RIPTE computable]]/DAY(EOMONTH(Tabla2[[#This Row],[Mes Intereses]],0))*Tabla2[[#This Row],[Dias de \nintereses]],4)","v":0}]
[null,null,null,"2020-05-01",6521.87,6445.13,{"$f":"ROUND(Tabla2[[#This Row],[Índice RIPTE computable]]/F231-1,4)","v":6.25E-2},{"$f":"IFERROR(IF($F$9>(EOMONTH(Tabla2[[#This Row],[Mes Intereses]],0)),(MIN(DATEDIF($F$7-1,EOMONTH(Tabla2[[#This Row],[Mes Intereses]],0),\"d\"),DAY(EOMONTH(D232,0)))),DATEDIF(MAX($F$7,Tabla2[[#This Row],[Mes Intereses]]),$F$9+1,\"d\")),0)","v":0},{"$f":"ROUND(Tabla2[[#This Row],[% var. \nÍndice RIPTE computable]]/DAY(EOMONTH(Tabla2[[#This Row],[Mes Intereses]],0))*Tabla2[[#This Row],[Dias de \nintereses]],4)","v":0}]
[null,null,null,"2020-06-01",6670.93,6500.72,{"$f":"ROUND(Tabla2[[#This Row],[Índice RIPTE computable]]/F232-1,4)","v":8.6E-3},{"$f":"IFERROR(IF($F$9>(EOMONTH(Tabla2[[#This Row],[Mes Intereses]],0)),(MIN(DATEDIF($F$7-1,EOMONTH(Tabla2[[#This Row],[Mes Intereses]],0),\"d\"),DAY(EOMONTH(D233,0)))),DATEDIF(MAX($F$7,Tabla2[[#This Row],[Mes Intereses]]),$F$9+1,\"d\")),0)","v":0},{"$f":"ROUND(Tabla2[[#This Row],[% var. \nÍndice RIPTE computable]]/DAY(EOMONTH(Tabla2[[#This Row],[Mes Intereses]],0))*Tabla2[[#This Row],[Dias de \nintereses]],4)","v":0}]
[null,null,null,"2020-07-01",6908.52,6510.18,{"$f":"ROUND(Tabla2[[#This Row],[Índice RIPTE computable]]/F233-1,4)","v":1.5E-3},{"$f":"IFERROR(IF($F$9>(EOMONTH(Tabla2[[#This Row],[Mes Intereses]],0)),(MIN(DATEDIF($F$7-1,EOMONTH(Tabla2[[#This Row],[Mes Intereses]],0),\"d\"),DAY(EOMONTH(D234,0)))),DATEDIF(MAX($F$7,Tabla2[[#This Row],[Mes Intereses]]),$F$9+1,\"d\")),0)","v":0},{"$f":"ROUND(Tabla2[[#This Row],[% var. \nÍndice RIPTE computable]]/DAY(EOMONTH(Tabla2[[#This Row],[Mes Intereses]],0))*Tabla2[[#This Row],[Dias de \nintereses]],4)","v":0}]
[null,null,null,"2020-08-01",6945.86,6521.87,{"$f":"ROUND(Tabla2[[#This Row],[Índice RIPTE computable]]/F234-1,4)","v":1.8E-3},{"$f":"IFERROR(IF($F$9>(EOMONTH(Tabla2[[#This Row],[Mes Intereses]],0)),(MIN(DATEDIF($F$7-1,EOMONTH(Tabla2[[#This Row],[Mes Intereses]],0),\"d\"),DAY(EOMONTH(D235,0)))),DATEDIF(MAX($F$7,Tabla2[[#This Row],[Mes Intereses]]),$F$9+1,\"d\")),0)","v":0},{"$f":"ROUND(Tabla2[[#This Row],[% var. \nÍndice RIPTE computable]]/DAY(EOMONTH(Tabla2[[#This Row],[Mes Intereses]],0))*Tabla2[[#This Row],[Dias de \nintereses]],4)","v":0}]
[null,null,null,"2020-09-01",7076.47,6670.93,{"$f":"ROUND(Tabla2[[#This Row],[Índice RIPTE computable]]/F235-1,4)","v":2.29E-2},{"$f":"IFERROR(IF($F$9>(EOMONTH(Tabla2[[#This Row],[Mes Intereses]],0)),(MIN(DATEDIF($F$7-1,EOMONTH(Tabla2[[#This Row],[Mes Intereses]],0),\"d\"),DAY(EOMONTH(D236,0)))),DATEDIF(MAX($F$7,Tabla2[[#This Row],[Mes Intereses]]),$F$9+1,\"d\")),0)","v":0},{"$f":"ROUND(Tabla2[[#This Row],[% var. \nÍndice RIPTE computable]]/DAY(EOMONTH(Tabla2[[#This Row],[Mes Intereses]],0))*Tabla2[[#This Row],[Dias de \nintereses]],4)","v":0}]
[null,null,null,"2020-10-01",7401.81,6908.52,{"$f":"ROUND(Tabla2[[#This Row],[Índice RIPTE computable]]/F236-1,4)","v":3.56E-2},{"$f":"IFERROR(IF($F$9>(EOMONTH(Tabla2[[#This Row],[Mes Intereses]],0)),(MIN(DATEDIF($F$7-1,EOMONTH(Tabla2[[#This Row],[Mes Intereses]],0),\"d\"),DAY(EOMONTH(D237,0)))),DATEDIF(MAX($F$7,Tabla2[[#This Row],[Mes Intereses]]),$F$9+1,\"d\")),0)","v":0},{"$f":"ROUND(Tabla2[[#This Row],[% var. \nÍndice RIPTE computable]]/DAY(EOMONTH(Tabla2[[#This Row],[Mes Intereses]],0))*Tabla2[[#This Row],[Dias de \nintereses]],4)","v":0}]
[null,null,null,"2020-11-01",7495.03,6945.86,{"$f":"ROUND(Tabla2[[#This Row],[Índice RIPTE computable]]/F237-1,4)","v":5.4000000000000003E-3},{"$f":"IFERROR(IF($F$9>(EOMONTH(Tabla2[[#This Row],[Mes Intereses]],0)),(MIN(DATEDIF($F$7-1,EOMONTH(Tabla2[[#This Row],[Mes Intereses]],0),\"d\"),DAY(EOMONTH(D238,0)))),DATEDIF(MAX($F$7,Tabla2[[#This Row],[Mes Intereses]]),$F$9+1,\"d\")),0)","v":0},{"$f":"ROUND(Tabla2[[#This Row],[% var. \nÍndice RIPTE computable]]/DAY(EOMONTH(Tabla2[[#This Row],[Mes Intereses]],0))*Tabla2[[#This Row],[Dias de \nintereses]],4)","v":0}]
[null,null,null,"2020-12-01",7643.41,7076.47,{"$f":"ROUND(Tabla2[[#This Row],[Índice RIPTE computable]]/F238-1,4)","v":1.8800000000000001E-2},{"$f":"IFERROR(IF($F$9>(EOMONTH(Tabla2[[#This Row],[Mes Intereses]],0)),(MIN(DATEDIF($F$7-1,EOMONTH(Tabla2[[#This Row],[Mes Intereses]],0),\"d\"),DAY(EOMONTH(D239,0)))),DATEDIF(MAX($F$7,Tabla2[[#This Row],[Mes Intereses]]),$F$9+1,\"d\")),0)","v":0},{"$f":"ROUND(Tabla2[[#This Row],[% var. \nÍndice RIPTE computable]]/DAY(EOMONTH(Tabla2[[#This Row],[Mes Intereses]],0))*Tabla2[[#This Row],[Dias de \nintereses]],4)","v":0}]
[null,null,null,"2021-01-01",7784.1,7401.81,{"$f":"ROUND(Tabla2[[#This Row],[Índice RIPTE computable]]/F239-1,4)","v":4.5999999999999999E-2},{"$f":"IFERROR(IF($F$9>(EOMONTH(Tabla2[[#This Row],[Mes Intereses]],0)),(MIN(DATEDIF($F$7-1,EOMONTH(Tabla2[[#This Row],[Mes Intereses]],0),\"d\"),DAY(EOMONTH(D240,0)))),DATEDIF(MAX($F$7,Tabla2[[#This Row],[Mes Intereses]]),$F$9+1,\"d\")),0)","v":0},{"$f":"ROUND(Tabla2[[#This Row],[% var. \nÍndice RIPTE computable]]/DAY(EOMONTH(Tabla2[[#This Row],[Mes Intereses]],0))*Tabla2[[#This Row],[Dias de \nintereses]],4)","v":0}]
[null,null,null,"2021-02-01",8263.33,7495.03,{"$f":"ROUND(Tabla2[[#This Row],[Índice RIPTE computable]]/F240-1,4)","v":1.26E-2},{"$f":"IFERROR(IF($F$9>(EOMONTH(Tabla2[[#This Row],[Mes Intereses]],0)),(MIN(DATEDIF($F$7-1,EOMONTH(Tabla2[[#This Row],[Mes Intereses]],0),\"d\"),DAY(EOMONTH(D241,0)))),DATEDIF(MAX($F$7,Tabla2[[#This Row],[Mes Intereses]]),$F$9+1,\"d\")),0)","v":0},{"$f":"ROUND(Tabla2[[#This Row],[% var. \nÍndice RIPTE computable]]/DAY(EOMONTH(Tabla2[[#This Row],[Mes Intereses]],0))*Tabla2[[#This Row],[Dias de \nintereses]],4)","v":0}]
[null,null,null,"2021-03-01",8665.19,7643.41,{"$f":"ROUND(Tabla2[[#This Row],[Índice RIPTE computable]]/F241-1,4)","v":1.9800000000000002E-2},{"$f":"IFERROR(IF($F$9>(EOMONTH(Tabla2[[#This Row],[Mes Intereses]],0)),(MIN(DATEDIF($F$7-1,EOMONTH(Tabla2[[#This Row],[Mes Intereses]],0),\"d\"),DAY(EOMONTH(D242,0)))),DATEDIF(MAX($F$7,Tabla2[[#This Row],[Mes Intereses]]),$F$9+1,\"d\")),0)","v":0},{"$f":"ROUND(Tabla2[[#This Row],[% var. \nÍndice RIPTE computable]]/DAY(EOMONTH(Tabla2[[#This Row],[Mes Intereses]],0))*Tabla2[[#This Row],[Dias de \nintereses]],4)","v":0}]
[null,null,null,"2021-04-01",9201.59,7784.1,{"$f":"ROUND(Tabla2[[#This Row],[Índice RIPTE computable]]/F242-1,4)","v":1.84E-2},{"$f":"IFERROR(IF($F$9>(EOMONTH(Tabla2[[#This Row],[Mes Intereses]],0)),(MIN(DATEDIF($F$7-1,EOMONTH(Tabla2[[#This Row],[Mes Intereses]],0),\"d\"),DAY(EOMONTH(D243,0)))),DATEDIF(MAX($F$7,Tabla2[[#This Row],[Mes Intereses]]),$F$9+1,\"d\")),0)","v":0},{"$f":"ROUND(Tabla2[[#This Row],[% var. \nÍndice RIPTE computable]]/DAY(EOMONTH(Tabla2[[#This Row],[Mes Intereses]],0))*Tabla2[[#This Row],[Dias de \nintereses]],4)","v":0}]
[null,null,null,"2021-05-01",9311.61,8263.33,{"$f":"ROUND(Tabla2[[#This Row],[Índice RIPTE computable]]/F243-1,4)","v":6.1600000000000002E-2},{"$f":"IFERROR(IF($F$9>(EOMONTH(Tabla2[[#This Row],[Mes Intereses]],0)),(MIN(DATEDIF($F$7-1,EOMONTH(Tabla2[[#This Row],[Mes Intereses]],0),\"d\"),DAY(EOMONTH(D244,0)))),DATEDIF(MAX($F$7,Tabla2[[#This Row],[Mes Intereses]]),$F$9+1,\"d\")),0)","v":0},{"$f":"ROUND(Tabla2[[#This Row],[% var. \nÍndice RIPTE computable]]/DAY(EOMONTH(Tabla2[[#This Row],[Mes Intereses]],0))*Tabla2[[#This Row],[Dias de \nintereses]],4)","v":0}]
[null,null,null,"2021-06-01",9660.1299999999992,8665.19,{"$f":"ROUND(Tabla2[[#This Row],[Índice RIPTE computable]]/F244-1,4)","v":4.8599999999999997E-2},{"$f":"IFERROR(IF($F$9>(EOMONTH(Tabla2[[#This Row],[Mes Intereses]],0)),(MIN(DATEDIF($F$7-1,EOMONTH(Tabla2[[#This Row],[Mes Intereses]],0),\"d\"),DAY(EOMONTH(D245,0)))),DATEDIF(MAX($F$7,Tabla2[[#This Row],[Mes Intereses]]),$F$9+1,\"d\")),0)","v":0},{"$f":"ROUND(Tabla2[[#This Row],[% var. \nÍndice RIPTE computable]]/DAY(EOMONTH(Tabla2[[#This Row],[Mes Intereses]],0))*Tabla2[[#This Row],[Dias de \nintereses]],4)","v":0}]
[null,null,null,"2021-07-01",10089.959999999999,9201.59,{"$f":"ROUND(Tabla2[[#This Row],[Índice RIPTE computable]]/F245-1,4)","v":6.1899999999999997E-2},{"$f":"IFERROR(IF($F$9>(EOMONTH(Tabla2[[#This Row],[Mes Intereses]],0)),(MIN(DATEDIF($F$7-1,EOMONTH(Tabla2[[#This Row],[Mes Intereses]],0),\"d\"),DAY(EOMONTH(D246,0)))),DATEDIF(MAX($F$7,Tabla2[[#This Row],[Mes Intereses]]),$F$9+1,\"d\")),0)","v":0},{"$f":"ROUND(Tabla2[[#This Row],[% var. \nÍndice RIPTE computable]]/DAY(EOMONTH(Tabla2[[#This Row],[Mes Intereses]],0))*Tabla2[[#This Row],[Dias de \nintereses]],4)","v":0}]
[null,null,null,"2021-08-01",10326.11,9311.61,{"$f":"ROUND(Tabla2[[#This Row],[Índice RIPTE computable]]/F246-1,4)","v":1.2E-2},{"$f":"IFERROR(IF($F$9>(EOMONTH(Tabla2[[#This Row],[Mes Intereses]],0)),(MIN(DATEDIF($F$7-1,EOMONTH(Tabla2[[#This Row],[Mes Intereses]],0),\"d\"),DAY(EOMONTH(D247,0)))),DATEDIF(MAX($F$7,Tabla2[[#This Row],[Mes Intereses]]),$F$9+1,\"d\")),0)","v":0},{"$f":"ROUND(Tabla2[[#This Row],[% var. \nÍndice RIPTE computable]]/DAY(EOMONTH(Tabla2[[#This Row],[Mes Intereses]],0))*Tabla2[[#This Row],[Dias de \nintereses]],4)","v":0}]
[null,null,null,"2021-09-01",10762.48,{"$f":"+E245","v":9660.1299999999992},{"$f":"ROUND(Tabla2[[#This Row],[Índice RIPTE computable]]/F247-1,4)","v":3.7400000000000003E-2},{"$f":"IFERROR(IF($F$9>(EOMONTH(Tabla2[[#This Row],[Mes Intereses]],0)),(MIN(DATEDIF($F$7-1,EOMONTH(Tabla2[[#This Row],[Mes Intereses]],0),\"d\"),DAY(EOMONTH(D248,0)))),DATEDIF(MAX($F$7,Tabla2[[#This Row],[Mes Intereses]]),$F$9+1,\"d\")),0)","v":0},{"$f":"ROUND(Tabla2[[#This Row],[% var. \nÍndice RIPTE computable]]/DAY(EOMONTH(Tabla2[[#This Row],[Mes Intereses]],0))*Tabla2[[#This Row],[Dias de \nintereses]],4)","v":0}]
[null,null,null,"2021-10-01",11148.95,10089.959999999999,{"$f":"ROUND(Tabla2[[#This Row],[Índice RIPTE computable]]/F248-1,4)","v":4.4499999999999998E-2},{"$f":"IFERROR(IF($F$9>(EOMONTH(Tabla2[[#This Row],[Mes Intereses]],0)),(MIN(DATEDIF($F$7-1,EOMONTH(Tabla2[[#This Row],[Mes Intereses]],0),\"d\"),DAY(EOMONTH(D249,0)))),DATEDIF(MAX($F$7,Tabla2[[#This Row],[Mes Intereses]]),$F$9+1,\"d\")),0)","v":0},{"$f":"ROUND(Tabla2[[#This Row],[% var. \nÍndice RIPTE computable]]/DAY(EOMONTH(Tabla2[[#This Row],[Mes Intereses]],0))*Tabla2[[#This Row],[Dias de \nintereses]],4)","v":0}]
[null,null,null,"2021-11-01",11497.72,10326.11,{"$f":"ROUND(Tabla2[[#This Row],[Índice RIPTE computable]]/F249-1,4)","v":2.3400000000000001E-2},{"$f":"IFERROR(IF($F$9>(EOMONTH(Tabla2[[#This Row],[Mes Intereses]],0)),(MIN(DATEDIF($F$7-1,EOMONTH(Tabla2[[#This Row],[Mes Intereses]],0),\"d\"),DAY(EOMONTH(D250,0)))),DATEDIF(MAX($F$7,Tabla2[[#This Row],[Mes Intereses]]),$F$9+1,\"d\")),0)","v":0},{"$f":"ROUND(Tabla2[[#This Row],[% var. \nÍndice RIPTE computable]]/DAY(EOMONTH(Tabla2[[#This Row],[Mes Intereses]],0))*Tabla2[[#This Row],[Dias de \nintereses]],4)","v":0}]
[null,null,null,"2021-12-01",11726.3,10762.48,{"$f":"ROUND(Tabla2[[#This Row],[Índice RIPTE computable]]/F250-1,4)","v":4.2299999999999997E-2},{"$f":"IFERROR(IF($F$9>(EOMONTH(Tabla2[[#This Row],[Mes Intereses]],0)),(MIN(DATEDIF($F$7-1,EOMONTH(Tabla2[[#This Row],[Mes Intereses]],0),\"d\"),DAY(EOMONTH(D251,0)))),DATEDIF(MAX($F$7,Tabla2[[#This Row],[Mes Intereses]]),$F$9+1,\"d\")),0)","v":0},{"$f":"ROUND(Tabla2[[#This Row],[% var. \nÍndice RIPTE computable]]/DAY(EOMONTH(Tabla2[[#This Row],[Mes Intereses]],0))*Tabla2[[#This Row],[Dias de \nintereses]],4)","v":0}]
[null,null,null,"2022-01-01",12271.35,11148.95,{"$f":"ROUND(Tabla2[[#This Row],[Índice RIPTE computable]]/F251-1,4)","v":3.5900000000000001E-2},{"$f":"IFERROR(IF($F$9>(EOMONTH(Tabla2[[#This Row],[Mes Intereses]],0)),(MIN(DATEDIF($F$7-1,EOMONTH(Tabla2[[#This Row],[Mes Intereses]],0),\"d\"),DAY(EOMONTH(D252,0)))),DATEDIF(MAX($F$7,Tabla2[[#This Row],[Mes Intereses]]),$F$9+1,\"d\")),0)","v":0},{"$f":"ROUND(Tabla2[[#This Row],[% var. \nÍndice RIPTE computable]]/DAY(EOMONTH(Tabla2[[#This Row],[Mes Intereses]],0))*Tabla2[[#This Row],[Dias de \nintereses]],4)","v":0}]
[null,null,null,"2022-02-01",12849.2,11497.72,{"$f":"ROUND(Tabla2[[#This Row],[Índice RIPTE computable]]/F252-1,4)","v":3.1300000000000001E-2},{"$f":"IFERROR(IF($F$9>(EOMONTH(Tabla2[[#This Row],[Mes Intereses]],0)),(MIN(DATEDIF($F$7-1,EOMONTH(Tabla2[[#This Row],[Mes Intereses]],0),\"d\"),DAY(EOMONTH(D253,0)))),DATEDIF(MAX($F$7,Tabla2[[#This Row],[Mes Intereses]]),$F$9+1,\"d\")),0)","v":0},{"$f":"ROUND(Tabla2[[#This Row],[% var. \nÍndice RIPTE computable]]/DAY(EOMONTH(Tabla2[[#This Row],[Mes Intereses]],0))*Tabla2[[#This Row],[Dias de \nintereses]],4)","v":0}]
[null,null,null,"2022-03-01",13855.82,11726.3,{"$f":"ROUND(Tabla2[[#This Row],[Índice RIPTE computable]]/F253-1,4)","v":1.9900000000000001E-2},{"$f":"IFERROR(IF($F$9>(EOMONTH(Tabla2[[#This Row],[Mes Intereses]],0)),(MIN(DATEDIF($F$7-1,EOMONTH(Tabla2[[#This Row],[Mes Intereses]],0),\"d\"),DAY(EOMONTH(D254,0)))),DATEDIF(MAX($F$7,Tabla2[[#This Row],[Mes Intereses]]),$F$9+1,\"d\")),0)","v":0},{"$f":"ROUND(Tabla2[[#This Row],[% var. \nÍndice RIPTE computable]]/DAY(EOMONTH(Tabla2[[#This Row],[Mes Intereses]],0))*Tabla2[[#This Row],[Dias de \nintereses]],4)","v":0}]
[null,null,null,"2022-04-01",14677.19,12271.35,{"$f":"ROUND(Tabla2[[#This Row],[Índice RIPTE computable]]/F254-1,4)","v":4.65E-2},{"$f":"IFERROR(IF($F$9>(EOMONTH(Tabla2[[#This Row],[Mes Intereses]],0)),(MIN(DATEDIF($F$7-1,EOMONTH(Tabla2[[#This Row],[Mes Intereses]],0),\"d\"),DAY(EOMONTH(D255,0)))),DATEDIF(MAX($F$7,Tabla2[[#This Row],[Mes Intereses]]),$F$9+1,\"d\")),0)","v":0},{"$f":"ROUND(Tabla2[[#This Row],[% var. \nÍndice RIPTE computable]]/DAY(EOMONTH(Tabla2[[#This Row],[Mes Intereses]],0))*Tabla2[[#This Row],[Dias de \nintereses]],4)","v":0}]
[null,null,null,"2022-05-01",15270.36,12849.2,{"$f":"ROUND(Tabla2[[#This Row],[Índice RIPTE computable]]/F255-1,4)","v":4.7100000000000003E-2},{"$f":"IFERROR(IF($F$9>(EOMONTH(Tabla2[[#This Row],[Mes Intereses]],0)),(MIN(DATEDIF($F$7-1,EOMONTH(Tabla2[[#This Row],[Mes Intereses]],0),\"d\"),DAY(EOMONTH(D256,0)))),DATEDIF(MAX($F$7,Tabla2[[#This Row],[Mes Intereses]]),$F$9+1,\"d\")),0)","v":0},{"$f":"ROUND(Tabla2[[#This Row],[% var. \nÍndice RIPTE computable]]/DAY(EOMONTH(Tabla2[[#This Row],[Mes Intereses]],0))*Tabla2[[#This Row],[Dias de \nintereses]],4)","v":0}]
[null,null,null,"2022-06-01",16149.76,13855.82,{"$f":"ROUND(Tabla2[[#This Row],[Índice RIPTE computable]]/F256-1,4)","v":7.8299999999999995E-2},{"$f":"IFERROR(IF($F$9>(EOMONTH(Tabla2[[#This Row],[Mes Intereses]],0)),(MIN(DATEDIF($F$7-1,EOMONTH(Tabla2[[#This Row],[Mes Intereses]],0),\"d\"),DAY(EOMONTH(D257,0)))),DATEDIF(MAX($F$7,Tabla2[[#This Row],[Mes Intereses]]),$F$9+1,\"d\")),0)","v":0},{"$f":"ROUND(Tabla2[[#This Row],[% var. \nÍndice RIPTE computable]]/DAY(EOMONTH(Tabla2[[#This Row],[Mes Intereses]],0))*Tabla2[[#This Row],[Dias de \nintereses]],4)","v":0}]
[null,null,null,"2022-07-01",17009.599999999999,14677.19,{"$f":"ROUND(Tabla2[[#This Row],[Índice RIPTE computable]]/F257-1,4)","v":5.9299999999999999E-2},{"$f":"IFERROR(IF($F$9>(EOMONTH(Tabla2[[#This Row],[Mes Intereses]],0)),(MIN(DATEDIF($F$7-1,EOMONTH(Tabla2[[#This Row],[Mes Intereses]],0),\"d\"),DAY(EOMONTH(D258,0)))),DATEDIF(MAX($F$7,Tabla2[[#This Row],[Mes Intereses]]),$F$9+1,\"d\")),0)","v":0},{"$f":"ROUND(Tabla2[[#This Row],[% var. \nÍndice RIPTE computable]]/DAY(EOMONTH(Tabla2[[#This Row],[Mes Intereses]],0))*Tabla2[[#This Row],[Dias de \nintereses]],4)","v":0}]
[null,null,null,"2022-08-01",17786.79,15270.36,{"$f":"ROUND(Tabla2[[#This Row],[Índice RIPTE computable]]/F258-1,4)","v":4.0399999999999998E-2},{"$f":"IFERROR(IF($F$9>(EOMONTH(Tabla2[[#This Row],[Mes Intereses]],0)),(MIN(DATEDIF($F$7-1,EOMONTH(Tabla2[[#This Row],[Mes Intereses]],0),\"d\"),DAY(EOMONTH(D259,0)))),DATEDIF(MAX($F$7,Tabla2[[#This Row],[Mes Intereses]]),$F$9+1,\"d\")),0)","v":0},{"$f":"ROUND(Tabla2[[#This Row],[% var. \nÍndice RIPTE computable]]/DAY(EOMONTH(Tabla2[[#This Row],[Mes Intereses]],0))*Tabla2[[#This Row],[Dias de \nintereses]],4)","v":0}]
[null,null,null,"2022-09-01",18908.07,16149.76,{"$f":"ROUND(Tabla2[[#This Row],[Índice RIPTE computable]]/F259-1,4)","v":5.7599999999999998E-2},{"$f":"IFERROR(IF($F$9>(EOMONTH(Tabla2[[#This Row],[Mes Intereses]],0)),(MIN(DATEDIF($F$7-1,EOMONTH(Tabla2[[#This Row],[Mes Intereses]],0),\"d\"),DAY(EOMONTH(D260,0)))),DATEDIF(MAX($F$7,Tabla2[[#This Row],[Mes Intereses]]),$F$9+1,\"d\")),0)","v":0},{"$f":"ROUND(Tabla2[[#This Row],[% var. \nÍndice RIPTE computable]]/DAY(EOMONTH(Tabla2[[#This Row],[Mes Intereses]],0))*Tabla2[[#This Row],[Dias de \nintereses]],4)","v":0}]
[null,null,null,"2022-10-01",19938.61,17009.599999999999,{"$f":"ROUND(Tabla2[[#This Row],[Índice RIPTE computable]]/F260-1,4)","v":5.3199999999999997E-2},{"$f":"IFERROR(IF($F$9>(EOMONTH(Tabla2[[#This Row],[Mes Intereses]],0)),(MIN(DATEDIF($F$7-1,EOMONTH(Tabla2[[#This Row],[Mes Intereses]],0),\"d\"),DAY(EOMONTH(D261,0)))),DATEDIF(MAX($F$7,Tabla2[[#This Row],[Mes Intereses]]),$F$9+1,\"d\")),0)","v":0},{"$f":"ROUND(Tabla2[[#This Row],[% var. \nÍndice RIPTE computable]]/DAY(EOMONTH(Tabla2[[#This Row],[Mes Intereses]],0))*Tabla2[[#This Row],[Dias de \nintereses]],4)","v":0}]
[null,null,null,"2022-11-01",21055.73,17786.79,{"$f":"ROUND(Tabla2[[#This Row],[Índice RIPTE computable]]/F261-1,4)","v":4.5699999999999998E-2},{"$f":"IFERROR(IF($F$9>(EOMONTH(Tabla2[[#This Row],[Mes Intereses]],0)),(MIN(DATEDIF($F$7-1,EOMONTH(Tabla2[[#This Row],[Mes Intereses]],0),\"d\"),DAY(EOMONTH(D262,0)))),DATEDIF(MAX($F$7,Tabla2[[#This Row],[Mes Intereses]]),$F$9+1,\"d\")),0)","v":0},{"$f":"ROUND(Tabla2[[#This Row],[% var. \nÍndice RIPTE computable]]/DAY(EOMONTH(Tabla2[[#This Row],[Mes Intereses]],0))*Tabla2[[#This Row],[Dias de \nintereses]],4)","v":0}]
[null,null,null,"2022-12-01",22194.74,18908.07,{"$f":"ROUND(Tabla2[[#This Row],[Índice RIPTE computable]]/F262-1,4)","v":6.3E-2},{"$f":"IFERROR(IF($F$9>(EOMONTH(Tabla2[[#This Row],[Mes Intereses]],0)),(MIN(DATEDIF($F$7-1,EOMONTH(Tabla2[[#This Row],[Mes Intereses]],0),\"d\"),DAY(EOMONTH(D263,0)))),DATEDIF(MAX($F$7,Tabla2[[#This Row],[Mes Intereses]]),$F$9+1,\"d\")),0)","v":0},{"$f":"ROUND(Tabla2[[#This Row],[% var. \nÍndice RIPTE computable]]/DAY(EOMONTH(Tabla2[[#This Row],[Mes Intereses]],0))*Tabla2[[#This Row],[Dias de \nintereses]],4)","v":0}]
[null,null,null,"2023-01-01",23041.17,19938.61,{"$f":"ROUND(Tabla2[[#This Row],[Índice RIPTE computable]]/F263-1,4)","v":5.45E-2},{"$f":"IFERROR(IF($F$9>(EOMONTH(Tabla2[[#This Row],[Mes Intereses]],0)),(MIN(DATEDIF($F$7-1,EOMONTH(Tabla2[[#This Row],[Mes Intereses]],0),\"d\"),DAY(EOMONTH(D264,0)))),DATEDIF(MAX($F$7,Tabla2[[#This Row],[Mes Intereses]]),$F$9+1,\"d\")),0)","v":0},{"$f":"ROUND(Tabla2[[#This Row],[% var. \nÍndice RIPTE computable]]/DAY(EOMONTH(Tabla2[[#This Row],[Mes Intereses]],0))*Tabla2[[#This Row],[Dias de \nintereses]],4)","v":0}]
[null,null,null,"2023-02-01",24980.16,21055.73,{"$f":"ROUND(Tabla2[[#This Row],[Índice RIPTE computable]]/F264-1,4)","v":5.6000000000000001E-2},{"$f":"IFERROR(IF($F$9>(EOMONTH(Tabla2[[#This Row],[Mes Intereses]],0)),(MIN(DATEDIF($F$7-1,EOMONTH(Tabla2[[#This Row],[Mes Intereses]],0),\"d\"),DAY(EOMONTH(D265,0)))),DATEDIF(MAX($F$7,Tabla2[[#This Row],[Mes Intereses]]),$F$9+1,\"d\")),0)","v":0},{"$f":"ROUND(Tabla2[[#This Row],[% var. \nÍndice RIPTE computable]]/DAY(EOMONTH(Tabla2[[#This Row],[Mes Intereses]],0))*Tabla2[[#This Row],[Dias de \nintereses]],4)","v":0}]
[null,null,null,"2023-03-01",27419.24,22194.74,{"$f":"ROUND(Tabla2[[#This Row],[Índice RIPTE computable]]/F265-1,4)","v":5.4100000000000002E-2},{"$f":"IFERROR(IF($F$9>(EOMONTH(Tabla2[[#This Row],[Mes Intereses]],0)),(MIN(DATEDIF($F$7-1,EOMONTH(Tabla2[[#This Row],[Mes Intereses]],0),\"d\"),DAY(EOMONTH(D266,0)))),DATEDIF(MAX($F$7,Tabla2[[#This Row],[Mes Intereses]]),$F$9+1,\"d\")),0)","v":0},{"$f":"ROUND(Tabla2[[#This Row],[% var. \nÍndice RIPTE computable]]/DAY(EOMONTH(Tabla2[[#This Row],[Mes Intereses]],0))*Tabla2[[#This Row],[Dias de \nintereses]],4)","v":0}]
[null,null,null,"2023-04-01",30116.61,23041.17,{"$f":"ROUND(Tabla2[[#This Row],[Índice RIPTE computable]]/F266-1,4)","v":3.8100000000000002E-2},{"$f":"IFERROR(IF($F$9>(EOMONTH(Tabla2[[#This Row],[Mes Intereses]],0)),(MIN(DATEDIF($F$7-1,EOMONTH(Tabla2[[#This Row],[Mes Intereses]],0),\"d\"),DAY(EOMONTH(D267,0)))),DATEDIF(MAX($F$7,Tabla2[[#This Row],[Mes Intereses]]),$F$9+1,\"d\")),0)","v":0},{"$f":"ROUND(Tabla2[[#This Row],[% var. \nÍndice RIPTE computable]]/DAY(EOMONTH(Tabla2[[#This Row],[Mes Intereses]],0))*Tabla2[[#This Row],[Dias de \nintereses]],4)","v":0}]
[null,null,null,"2023-05-01",31984.22,24980.16,{"$f":"ROUND(Tabla2[[#This Row],[Índice RIPTE computable]]/F267-1,4)","v":8.4199999999999997E-2},{"$f":"IFERROR(IF($F$9>(EOMONTH(Tabla2[[#This Row],[Mes Intereses]],0)),(MIN(DATEDIF($F$7-1,EOMONTH(Tabla2[[#This Row],[Mes Intereses]],0),\"d\"),DAY(EOMONTH(D268,0)))),DATEDIF(MAX($F$7,Tabla2[[#This Row],[Mes Intereses]]),$F$9+1,\"d\")),0)","v":0},{"$f":"ROUND(Tabla2[[#This Row],[% var. \nÍndice RIPTE computable]]/DAY(EOMONTH(Tabla2[[#This Row],[Mes Intereses]],0))*Tabla2[[#This Row],[Dias de \nintereses]],4)","v":0}]
[null,null,null,"2023-06-01",34583.730000000003,27419.24,{"$f":"ROUND(Tabla2[[#This Row],[Índice RIPTE computable]]/F268-1,4)","v":9.7600000000000006E-2},{"$f":"IFERROR(IF($F$9>(EOMONTH(Tabla2[[#This Row],[Mes Intereses]],0)),(MIN(DATEDIF($F$7-1,EOMONTH(Tabla2[[#This Row],[Mes Intereses]],0),\"d\"),DAY(EOMONTH(D269,0)))),DATEDIF(MAX($F$7,Tabla2[[#This Row],[Mes Intereses]]),$F$9+1,\"d\")),0)","v":0},{"$f":"ROUND(Tabla2[[#This Row],[% var. \nÍndice RIPTE computable]]/DAY(EOMONTH(Tabla2[[#This Row],[Mes Intereses]],0))*Tabla2[[#This Row],[Dias de \nintereses]],4)","v":0}]
[null,null,null,"2023-07-01",37148.07,30116.61,{"$f":"ROUND(Tabla2[[#This Row],[Índice RIPTE computable]]/F269-1,4)","v":9.8400000000000001E-2},{"$f":"IFERROR(IF($F$9>(EOMONTH(Tabla2[[#This Row],[Mes Intereses]],0)),(MIN(DATEDIF($F$7-1,EOMONTH(Tabla2[[#This Row],[Mes Intereses]],0),\"d\"),DAY(EOMONTH(D270,0)))),DATEDIF(MAX($F$7,Tabla2[[#This Row],[Mes Intereses]]),$F$9+1,\"d\")),0)","v":0},{"$f":"ROUND(Tabla2[[#This Row],[% var. \nÍndice RIPTE computable]]/DAY(EOMONTH(Tabla2[[#This Row],[Mes Intereses]],0))*Tabla2[[#This Row],[Dias de \nintereses]],4)","v":0}]
[null,null,null,"2023-08-01",39326.69,31984.22,{"$f":"ROUND(Tabla2[[#This Row],[Índice RIPTE computable]]/F270-1,4)","v":6.2E-2},{"$f":"IFERROR(IF($F$9>(EOMONTH(Tabla2[[#This Row],[Mes Intereses]],0)),(MIN(DATEDIF($F$7-1,EOMONTH(Tabla2[[#This Row],[Mes Intereses]],0),\"d\"),DAY(EOMONTH(D271,0)))),DATEDIF(MAX($F$7,Tabla2[[#This Row],[Mes Intereses]]),$F$9+1,\"d\")),0)","v":0},{"$f":"ROUND(Tabla2[[#This Row],[% var. \nÍndice RIPTE computable]]/DAY(EOMONTH(Tabla2[[#This Row],[Mes Intereses]],0))*Tabla2[[#This Row],[Dias de \nintereses]],4)","v":0}]
[null,null,null,"2023-09-01",43045.75,34583.730000000003,{"$f":"ROUND(Tabla2[[#This Row],[Índice RIPTE computable]]/F271-1,4)","v":8.1299999999999997E-2},{"$f":"IFERROR(IF($F$9>(EOMONTH(Tabla2[[#This Row],[Mes Intereses]],0)),(MIN(DATEDIF($F$7-1,EOMONTH(Tabla2[[#This Row],[Mes Intereses]],0),\"d\"),DAY(EOMONTH(D272,0)))),DATEDIF(MAX($F$7,Tabla2[[#This Row],[Mes Intereses]]),$F$9+1,\"d\")),0)","v":0},{"$f":"ROUND(Tabla2[[#This Row],[% var. \nÍndice RIPTE computable]]/DAY(EOMONTH(Tabla2[[#This Row],[Mes Intereses]],0))*Tabla2[[#This Row],[Dias de \nintereses]],4)","v":0}]
[null,null,null,"2023-10-01",48087.89,37148.07,{"$f":"ROUND(Tabla2[[#This Row],[Índice RIPTE computable]]/F272-1,4)","v":7.4099999999999999E-2},{"$f":"IFERROR(IF($F$9>(EOMONTH(Tabla2[[#This Row],[Mes Intereses]],0)),(MIN(DATEDIF($F$7-1,EOMONTH(Tabla2[[#This Row],[Mes Intereses]],0),\"d\"),DAY(EOMONTH(D273,0)))),DATEDIF(MAX($F$7,Tabla2[[#This Row],[Mes Intereses]]),$F$9+1,\"d\")),0)","v":0},{"$f":"ROUND(Tabla2[[#This Row],[% var. \nÍndice RIPTE computable]]/DAY(EOMONTH(Tabla2[[#This Row],[Mes Intereses]],0))*Tabla2[[#This Row],[Dias de \nintereses]],4)","v":0}]
[null,null,null,"2023-11-01",51102.400000000001,39326.69,{"$f":"ROUND(Tabla2[[#This Row],[Índice RIPTE computable]]/F273-1,4)","v":5.8599999999999999E-2},{"$f":"IFERROR(IF($F$9>(EOMONTH(Tabla2[[#This Row],[Mes Intereses]],0)),(MIN(DATEDIF($F$7-1,EOMONTH(Tabla2[[#This Row],[Mes Intereses]],0),\"d\"),DAY(EOMONTH(D274,0)))),DATEDIF(MAX($F$7,Tabla2[[#This Row],[Mes Intereses]]),$F$9+1,\"d\")),0)","v":0},{"$f":"ROUND(Tabla2[[#This Row],[% var. \nÍndice RIPTE computable]]/DAY(EOMONTH(Tabla2[[#This Row],[Mes Intereses]],0))*Tabla2[[#This Row],[Dias de \nintereses]],4)","v":0}]
[null,null,null,"2023-12-01",55356.61,43045.75,{"$f":"ROUND(Tabla2[[#This Row],[Índice RIPTE computable]]/F274-1,4)","v":9.4600000000000004E-2},{"$f":"IFERROR(IF($F$9>(EOMONTH(Tabla2[[#This Row],[Mes Intereses]],0)),(MIN(DATEDIF($F$7-1,EOMONTH(Tabla2[[#This Row],[Mes Intereses]],0),\"d\"),DAY(EOMONTH(D275,0)))),DATEDIF(MAX($F$7,Tabla2[[#This Row],[Mes Intereses]]),$F$9+1,\"d\")),0)","v":0},{"$f":"ROUND(Tabla2[[#This Row],[% var. \nÍndice RIPTE computable]]/DAY(EOMONTH(Tabla2[[#This Row],[Mes Intereses]],0))*Tabla2[[#This Row],[Dias de \nintereses]],4)","v":0}]
[null,null,null,"2024-01-01",{"$f":"G139","v":63468.76},48087.89,{"$f":"ROUND(Tabla2[[#This Row],[Índice RIPTE computable]]/F275-1,4)","v":0.1171},{"$f":"IFERROR(IF($F$9>(EOMONTH(Tabla2[[#This Row],[Mes Intereses]],0)),(MIN(DATEDIF($F$7-1,EOMONTH(Tabla2[[#This Row],[Mes Intereses]],0),\"d\"),DAY(EOMONTH(D276,0)))),DATEDIF(MAX($F$7,Tabla2[[#This Row],[Mes Intereses]]),$F$9+1,\"d\")),0)","v":0},{"$f":"ROUND(Tabla2[[#This Row],[% var. \nÍndice RIPTE computable]]/DAY(EOMONTH(Tabla2[[#This Row],[Mes Intereses]],0))*Tabla2[[#This Row],[Dias de \nintereses]],4)","v":0}]
[null,null,null,"2024-02-01",70754.17,51102.400000000001,{"$f":"ROUND(Tabla2[[#This Row],[Índice RIPTE computable]]/F276-1,4)","v":6.2700000000000006E-2},{"$f":"IFERROR(IF($F$9>(EOMONTH(Tabla2[[#This Row],[Mes Intereses]],0)),(MIN(DATEDIF($F$7-1,EOMONTH(Tabla2[[#This Row],[Mes Intereses]],0),\"d\"),DAY(EOMONTH(D277,0)))),DATEDIF(MAX($F$7,Tabla2[[#This Row],[Mes Intereses]]),$F$9+1,\"d\")),0)","v":0},{"$f":"ROUND(Tabla2[[#This Row],[% var. \nÍndice RIPTE computable]]/DAY(EOMONTH(Tabla2[[#This Row],[Mes Intereses]],0))*Tabla2[[#This Row],[Dias de \nintereses]],4)","v":0}]
[null,null,null,"2024-03-01",80678.570000000007,55356.61,{"$f":"ROUND(Tabla2[[#This Row],[Índice RIPTE computable]]/F277-1,4)","v":8.3199999999999996E-2},{"$f":"IFERROR(IF($F$9>(EOMONTH(Tabla2[[#This Row],[Mes Intereses]],0)),(MIN(DATEDIF($F$7-1,EOMONTH(Tabla2[[#This Row],[Mes Intereses]],0),\"d\"),DAY(EOMONTH(D278,0)))),DATEDIF(MAX($F$7,Tabla2[[#This Row],[Mes Intereses]]),$F$9+1,\"d\")),0)","v":0},{"$f":"ROUND(Tabla2[[#This Row],[% var. \nÍndice RIPTE computable]]/DAY(EOMONTH(Tabla2[[#This Row],[Mes Intereses]],0))*Tabla2[[#This Row],[Dias de \nintereses]],4)","v":0}]
[null,null,null,"2024-04-01",93671.26,63468.76,{"$f":"ROUND(Tabla2[[#This Row],[Índice RIPTE computable]]/F278-1,4)","v":0.14649999999999999},{"$f":"IFERROR(IF($F$9>(EOMONTH(Tabla2[[#This Row],[Mes Intereses]],0)),(MIN(DATEDIF($F$7-1,EOMONTH(Tabla2[[#This Row],[Mes Intereses]],0),\"d\"),DAY(EOMONTH(D279,0)))),DATEDIF(MAX($F$7,Tabla2[[#This Row],[Mes Intereses]]),$F$9+1,\"d\")),0)","v":0},{"$f":"ROUND(Tabla2[[#This Row],[% var. \nÍndice RIPTE computable]]/DAY(EOMONTH(Tabla2[[#This Row],[Mes Intereses]],0))*Tabla2[[#This Row],[Dias de \nintereses]],4)","v":0}]
[null,null,null,"2024-05-01",100527.29,70754.17,{"$f":"ROUND(Tabla2[[#This Row],[Índice RIPTE computable]]/F279-1,4)","v":0.1148},{"$f":"IFERROR(IF($F$9>(EOMONTH(Tabla2[[#This Row],[Mes Intereses]],0)),(MIN(DATEDIF($F$7-1,EOMONTH(Tabla2[[#This Row],[Mes Intereses]],0),\"d\"),DAY(EOMONTH(D280,0)))),DATEDIF(MAX($F$7,Tabla2[[#This Row],[Mes Intereses]]),$F$9+1,\"d\")),0)","v":0},{"$f":"ROUND(Tabla2[[#This Row],[% var. \nÍndice RIPTE computable]]/DAY(EOMONTH(Tabla2[[#This Row],[Mes Intereses]],0))*Tabla2[[#This Row],[Dias de \nintereses]],4)","v":0}]
[null,null,null,"2024-06-01",106664.97,80678.570000000007,{"$f":"ROUND(Tabla2[[#This Row],[Índice RIPTE computable]]/F280-1,4)","v":0.14030000000000001},{"$f":"IFERROR(IF($F$9>(EOMONTH(Tabla2[[#This Row],[Mes Intereses]],0)),(MIN(DATEDIF($F$7-1,EOMONTH(Tabla2[[#This Row],[Mes Intereses]],0),\"d\"),DAY(EOMONTH(D281,0)))),DATEDIF(MAX($F$7,Tabla2[[#This Row],[Mes Intereses]]),$F$9+1,\"d\")),0)","v":0},{"$f":"ROUND(Tabla2[[#This Row],[% var. \nÍndice RIPTE computable]]/DAY(EOMONTH(Tabla2[[#This Row],[Mes Intereses]],0))*Tabla2[[#This Row],[Dias de \nintereses]],4)","v":0}]
[null,null,null,"2024-07-01",113694.76,93671.26,{"$f":"ROUND(Tabla2[[#This Row],[Índice RIPTE computable]]/F281-1,4)","v":0.161},{"$f":"IFERROR(IF($F$9>(EOMONTH(Tabla2[[#This Row],[Mes Intereses]],0)),(MIN(DATEDIF($F$7-1,EOMONTH(Tabla2[[#This Row],[Mes Intereses]],0),\"d\"),DAY(EOMONTH(D282,0)))),DATEDIF(MAX($F$7,Tabla2[[#This Row],[Mes Intereses]]),$F$9+1,\"d\")),0)","v":0},{"$f":"ROUND(Tabla2[[#This Row],[% var. \nÍndice RIPTE computable]]/DAY(EOMONTH(Tabla2[[#This Row],[Mes Intereses]],0))*Tabla2[[#This Row],[Dias de \nintereses]],4)","v":0}]
[null,null,null,"2024-08-01",118007.3,100527.29,{"$f":"ROUND(Tabla2[[#This Row],[Índice RIPTE computable]]/F282-1,4)","v":7.3200000000000001E-2},{"$f":"IFERROR(IF($F$9>(EOMONTH(Tabla2[[#This Row],[Mes Intereses]],0)),(MIN(DATEDIF($F$7-1,EOMONTH(Tabla2[[#This Row],[Mes Intereses]],0),\"d\"),DAY(EOMONTH(D283,0)))),DATEDIF(MAX($F$7,Tabla2[[#This Row],[Mes Intereses]]),$F$9+1,\"d\")),0)","v":0},{"$f":"ROUND(Tabla2[[#This Row],[% var. \nÍndice RIPTE computable]]/DAY(EOMONTH(Tabla2[[#This Row],[Mes Intereses]],0))*Tabla2[[#This Row],[Dias de \nintereses]],4)","v":0}]
[null,null,null,"2024-09-01",122891.98,106664.97,{"$f":"ROUND(Tabla2[[#This Row],[Índice RIPTE computable]]/F283-1,4)","v":6.1100000000000002E-2},{"$f":"IFERROR(IF($F$9>(EOMONTH(Tabla2[[#This Row],[Mes Intereses]],0)),(MIN(DATEDIF($F$7-1,EOMONTH(Tabla2[[#This Row],[Mes Intereses]],0),\"d\"),DAY(EOMONTH(D284,0)))),DATEDIF(MAX($F$7,Tabla2[[#This Row],[Mes Intereses]]),$F$9+1,\"d\")),0)","v":0},{"$f":"ROUND(Tabla2[[#This Row],[% var. \nÍndice RIPTE computable]]/DAY(EOMONTH(Tabla2[[#This Row],[Mes Intereses]],0))*Tabla2[[#This Row],[Dias de \nintereses]],4)","v":0}]
[null,null,null,"2024-10-01",131045.09,113694.76,{"$f":"ROUND(Tabla2[[#This Row],[Índice RIPTE computable]]/F284-1,4)","v":6.59E-2},{"$f":"IFERROR(IF($F$9>(EOMONTH(Tabla2[[#This Row],[Mes Intereses]],0)),(MIN(DATEDIF($F$7-1,EOMONTH(Tabla2[[#This Row],[Mes Intereses]],0),\"d\"),DAY(EOMONTH(D285,0)))),DATEDIF(MAX($F$7,Tabla2[[#This Row],[Mes Intereses]]),$F$9+1,\"d\")),0)","v":0},{"$f":"ROUND(Tabla2[[#This Row],[% var. \nÍndice RIPTE computable]]/DAY(EOMONTH(Tabla2[[#This Row],[Mes Intereses]],0))*Tabla2[[#This Row],[Dias de \nintereses]],4)","v":0}]
[null,null,null,"2024-11-01",134754.34,118007.3,{"$f":"ROUND(Tabla2[[#This Row],[Índice RIPTE computable]]/F285-1,4)","v":3.7900000000000003E-2},{"$f":"IFERROR(IF($F$9>(EOMONTH(Tabla2[[#This Row],[Mes Intereses]],0)),(MIN(DATEDIF($F$7-1,EOMONTH(Tabla2[[#This Row],[Mes Intereses]],0),\"d\"),DAY(EOMONTH(D286,0)))),DATEDIF(MAX($F$7,Tabla2[[#This Row],[Mes Intereses]]),$F$9+1,\"d\")),0)","v":0},{"$f":"ROUND(Tabla2[[#This Row],[% var. \nÍndice RIPTE computable]]/DAY(EOMONTH(Tabla2[[#This Row],[Mes Intereses]],0))*Tabla2[[#This Row],[Dias de \nintereses]],4)","v":0}]
[null,null,null,"2024-12-01",137497.9,122891.98,{"$f":"ROUND(Tabla2[[#This Row],[Índice RIPTE computable]]/F286-1,4)","v":4.1399999999999999E-2},{"$f":"IFERROR(IF($F$9>(EOMONTH(Tabla2[[#This Row],[Mes Intereses]],0)),(MIN(DATEDIF($F$7-1,EOMONTH(Tabla2[[#This Row],[Mes Intereses]],0),\"d\"),DAY(EOMONTH(D287,0)))),DATEDIF(MAX($F$7,Tabla2[[#This Row],[Mes Intereses]]),$F$9+1,\"d\")),0)","v":0},{"$f":"ROUND(Tabla2[[#This Row],[% var. \nÍndice RIPTE computable]]/DAY(EOMONTH(Tabla2[[#This Row],[Mes Intereses]],0))*Tabla2[[#This Row],[Dias de \nintereses]],4)","v":0}]
[null,null,null,"2025-01-01",141124.78,131045.09,{"$f":"ROUND(Tabla2[[#This Row],[Índice RIPTE computable]]/F287-1,4)","v":6.6299999999999998E-2},{"$f":"IFERROR(IF($F$9>(EOMONTH(Tabla2[[#This Row],[Mes Intereses]],0)),(MIN(DATEDIF($F$7-1,EOMONTH(Tabla2[[#This Row],[Mes Intereses]],0),\"d\"),DAY(EOMONTH(D288,0)))),DATEDIF(MAX($F$7,Tabla2[[#This Row],[Mes Intereses]]),$F$9+1,\"d\")),0)","v":0},{"$f":"ROUND(Tabla2[[#This Row],[% var. \nÍndice RIPTE computable]]/DAY(EOMONTH(Tabla2[[#This Row],[Mes Intereses]],0))*Tabla2[[#This Row],[Dias de \nintereses]],4)","v":0}]
[null,null,null,"2025-02-01",149777.43,134754.34,{"$f":"ROUND(Tabla2[[#This Row],[Índice RIPTE computable]]/F288-1,4)","v":2.8299999999999999E-2},{"$f":"IFERROR(IF($F$9>(EOMONTH(Tabla2[[#This Row],[Mes Intereses]],0)),(MIN(DATEDIF($F$7-1,EOMONTH(Tabla2[[#This Row],[Mes Intereses]],0),\"d\"),DAY(EOMONTH(D289,0)))),DATEDIF(MAX($F$7,Tabla2[[#This Row],[Mes Intereses]]),$F$9+1,\"d\")),0)","v":0},{"$f":"ROUND(Tabla2[[#This Row],[% var. \nÍndice RIPTE computable]]/DAY(EOMONTH(Tabla2[[#This Row],[Mes Intereses]],0))*Tabla2[[#This Row],[Dias de \nintereses]],4)","v":0}]
[null,null,null,"2025-03-01",155852.91,137497.9,{"$f":"ROUND(Tabla2[[#This Row],[Índice RIPTE computable]]/F289-1,4)","v":2.0400000000000001E-2},{"$f":"IFERROR(IF($F$9>(EOMONTH(Tabla2[[#This Row],[Mes Intereses]],0)),(MIN(DATEDIF($F$7-1,EOMONTH(Tabla2[[#This Row],[Mes Intereses]],0),\"d\"),DAY(EOMONTH(D290,0)))),DATEDIF(MAX($F$7,Tabla2[[#This Row],[Mes Intereses]]),$F$9+1,\"d\")),0)","v":0},{"$f":"ROUND(Tabla2[[#This Row],[% var. \nÍndice RIPTE computable]]/DAY(EOMONTH(Tabla2[[#This Row],[Mes Intereses]],0))*Tabla2[[#This Row],[Dias de \nintereses]],4)","v":0}]
[null,null,null,"2025-04-01",160321.72,141124.78,{"$f":"IFERROR(ROUND(Tabla2[[#This Row],[Índice RIPTE computable]]/F290-1,4),\"índice no públicado\")","v":2.64E-2},{"$f":"IFERROR(IF($F$9>(EOMONTH(Tabla2[[#This Row],[Mes Intereses]],0)),(MIN(DATEDIF($F$7-1,EOMONTH(Tabla2[[#This Row],[Mes Intereses]],0),\"d\"),DAY(EOMONTH(D291,0)))),DATEDIF(MAX($F$7,Tabla2[[#This Row],[Mes Intereses]]),$F$9+1,\"d\")),0)","v":0},{"$f":"IFERROR(ROUND(Tabla2[[#This Row],[% var. \nÍndice RIPTE computable]]/DAY(EOMONTH(Tabla2[[#This Row],[Mes Intereses]],0))*Tabla2[[#This Row],[Dias de \nintereses]],4),\"índice no publicado\")","v":0}]
[null,null,null,"2025-05-01",163299.84,149777.43,{"$f":"IFERROR(ROUND(Tabla2[[#This Row],[Índice RIPTE computable]]/F291-1,4),\"índice no públicado\")","v":6.13E-2},{"$f":"IFERROR(IF($F$9>(EOMONTH(Tabla2[[#This Row],[Mes Intereses]],0)),(MIN(DATEDIF($F$7-1,EOMONTH(Tabla2[[#This Row],[Mes Intereses]],0),\"d\"),DAY(EOMONTH(D292,0)))),DATEDIF(MAX($F$7,Tabla2[[#This Row],[Mes Intereses]]),$F$9+1,\"d\")),0)","v":0},{"$f":"IFERROR(ROUND(Tabla2[[#This Row],[% var. \nÍndice RIPTE computable]]/DAY(EOMONTH(Tabla2[[#This Row],[Mes Intereses]],0))*Tabla2[[#This Row],[Dias de \nintereses]],4),\"índice no publicado\")","v":0}]
[null,null,null,"2025-06-01",167811.87,155852.91,{"$f":"IFERROR(ROUND(Tabla2[[#This Row],[Índice RIPTE computable]]/F292-1,4),\"índice no públicado\")","v":4.0599999999999997E-2},{"$f":"IFERROR(IF($F$9>(EOMONTH(Tabla2[[#This Row],[Mes Intereses]],0)),(MIN(DATEDIF($F$7-1,EOMONTH(Tabla2[[#This Row],[Mes Intereses]],0),\"d\"),DAY(EOMONTH(D293,0)))),DATEDIF(MAX($F$7,Tabla2[[#This Row],[Mes Intereses]]),$F$9+1,\"d\")),0)","v":0},{"$f":"IFERROR(ROUND(Tabla2[[#This Row],[% var. \nÍndice RIPTE computable]]/DAY(EOMONTH(Tabla2[[#This Row],[Mes Intereses]],0))*Tabla2[[#This Row],[Dias de \nintereses]],4),\"índice no publicado\")","v":0}]
[null,null,null,"2025-07-01",172674.89,160321.72,{"$f":"IFERROR(ROUND(Tabla2[[#This Row],[Índice RIPTE computable]]/F293-1,4),\"índice no públicado\")","v":2.87E-2},{"$f":"IFERROR(IF($F$9>(EOMONTH(Tabla2[[#This Row],[Mes Intereses]],0)),(MIN(DATEDIF($F$7-1,EOMONTH(Tabla2[[#This Row],[Mes Intereses]],0),\"d\"),DAY(EOMONTH(D294,0)))),DATEDIF(MAX($F$7,Tabla2[[#This Row],[Mes Intereses]]),$F$9+1,\"d\")),0)","v":0},{"$f":"IFERROR(ROUND(Tabla2[[#This Row],[% var. \nÍndice RIPTE computable]]/DAY(EOMONTH(Tabla2[[#This Row],[Mes Intereses]],0))*Tabla2[[#This Row],[Dias de \nintereses]],4),\"índice no publicado\")","v":0}]
[null,null,null,"2025-08-01",174917.11,163299.84,{"$f":"IFERROR(ROUND(Tabla2[[#This Row],[Índice RIPTE computable]]/F294-1,4),\"índice no públicado\")","v":1.8599999999999998E-2},{"$f":"IFERROR(IF($F$9>(EOMONTH(Tabla2[[#This Row],[Mes Intereses]],0)),(MIN(DATEDIF($F$7-1,EOMONTH(Tabla2[[#This Row],[Mes Intereses]],0),\"d\"),DAY(EOMONTH(D295,0)))),DATEDIF(MAX($F$7,Tabla2[[#This Row],[Mes Intereses]]),$F$9+1,\"d\")),0)","v":0},{"$f":"IFERROR(ROUND(Tabla2[[#This Row],[% var. \nÍndice RIPTE computable]]/DAY(EOMONTH(Tabla2[[#This Row],[Mes Intereses]],0))*Tabla2[[#This Row],[Dias de \nintereses]],4),\"índice no publicado\")","v":0}]
[null,null,null,"2025-09-01",{"$f":"G159","v":177378.55},167811.87,{"$f":"IFERROR(ROUND(Tabla2[[#This Row],[Índice RIPTE computable]]/F295-1,4),\"índice no públicado\")","v":2.76E-2},{"$f":"IFERROR(IF($F$9>(EOMONTH(Tabla2[[#This Row],[Mes Intereses]],0)),(MIN(DATEDIF($F$7-1,EOMONTH(Tabla2[[#This Row],[Mes Intereses]],0),\"d\"),DAY(EOMONTH(D296,0)))),DATEDIF(MAX($F$7,Tabla2[[#This Row],[Mes Intereses]]),$F$9+1,\"d\")),0)","v":0},{"$f":"IFERROR(ROUND(Tabla2[[#This Row],[% var. \nÍndice RIPTE computable]]/DAY(EOMONTH(Tabla2[[#This Row],[Mes Intereses]],0))*Tabla2[[#This Row],[Dias de \nintereses]],4),\"índice no publicado\")","v":0}]
[null,null,null,"2025-10-01",182089.61,172674.89,{"$f":"IFERROR(ROUND(Tabla2[[#This Row],[Índice RIPTE computable]]/F296-1,4),\"índice no públicado\")","v":2.9000000000000001E-2},{"$f":"IFERROR(IF($F$9>(EOMONTH(Tabla2[[#This Row],[Mes Intereses]],0)),(MIN(DATEDIF($F$7-1,EOMONTH(Tabla2[[#This Row],[Mes Intereses]],0),\"d\"),DAY(EOMONTH(D297,0)))),DATEDIF(MAX($F$7,Tabla2[[#This Row],[Mes Intereses]]),$F$9+1,\"d\")),0)","v":0},{"$f":"IFERROR(ROUND(Tabla2[[#This Row],[% var. \nÍndice RIPTE computable]]/DAY(EOMONTH(Tabla2[[#This Row],[Mes Intereses]],0))*Tabla2[[#This Row],[Dias de \nintereses]],4),\"índice no publicado\")","v":0}]
[null,null,null,"2025-11-01",184238.99,174917.11,{"$f":"IFERROR(ROUND(Tabla2[[#This Row],[Índice RIPTE computable]]/F297-1,4),\"índice no públicado\")","v":1.2999999999999999E-2},{"$f":"IFERROR(IF($F$9>(EOMONTH(Tabla2[[#This Row],[Mes Intereses]],0)),(MIN(DATEDIF($F$7-1,EOMONTH(Tabla2[[#This Row],[Mes Intereses]],0),\"d\"),DAY(EOMONTH(D298,0)))),DATEDIF(MAX($F$7,Tabla2[[#This Row],[Mes Intereses]]),$F$9+1,\"d\")),0)","v":0},{"$f":"IFERROR(ROUND(Tabla2[[#This Row],[% var. \nÍndice RIPTE computable]]/DAY(EOMONTH(Tabla2[[#This Row],[Mes Intereses]],0))*Tabla2[[#This Row],[Dias de \nintereses]],4),\"índice no publicado\")","v":0}]
[null,null,null,"2025-12-01",186718.83,177378.55,{"$f":"IFERROR(ROUND(Tabla2[[#This Row],[Índice RIPTE computable]]/F298-1,4),\"índice no públicado\")","v":1.41E-2},{"$f":"IFERROR(IF($F$9>(EOMONTH(Tabla2[[#This Row],[Mes Intereses]],0)),(MIN(DATEDIF($F$7-1,EOMONTH(Tabla2[[#This Row],[Mes Intereses]],0),\"d\"),DAY(EOMONTH(D299,0)))),DATEDIF(MAX($F$7,Tabla2[[#This Row],[Mes Intereses]]),$F$9+1,\"d\")),0)","v":0},{"$f":"IFERROR(ROUND(Tabla2[[#This Row],[% var. \nÍndice RIPTE computable]]/DAY(EOMONTH(Tabla2[[#This Row],[Mes Intereses]],0))*Tabla2[[#This Row],[Dias de \nintereses]],4),\"índice no publicado\")","v":0}]
[null,null,null,"2026-01-01",188181.62,182089.61,{"$f":"IFERROR(ROUND(Tabla2[[#This Row],[Índice RIPTE computable]]/F299-1,4),\"índice no públicado\")","v":2.6599999999999999E-2},{"$f":"IFERROR(IF($F$9>(EOMONTH(Tabla2[[#This Row],[Mes Intereses]],0)),(MIN(DATEDIF($F$7-1,EOMONTH(Tabla2[[#This Row],[Mes Intereses]],0),\"d\"),DAY(EOMONTH(D300,0)))),DATEDIF(MAX($F$7,Tabla2[[#This Row],[Mes Intereses]]),$F$9+1,\"d\")),0)","v":0},{"$f":"IFERROR(ROUND(Tabla2[[#This Row],[% var. \nÍndice RIPTE computable]]/DAY(EOMONTH(Tabla2[[#This Row],[Mes Intereses]],0))*Tabla2[[#This Row],[Dias de \nintereses]],4),\"índice no publicado\")","v":0}]
[null,null,null,"2026-02-01","índice no publicado",184238.99,{"$f":"IFERROR(ROUND(Tabla2[[#This Row],[Índice RIPTE computable]]/F300-1,4),\"índice no públicado\")","v":1.18E-2},{"$f":"IFERROR(IF($F$9>(EOMONTH(Tabla2[[#This Row],[Mes Intereses]],0)),(MIN(DATEDIF($F$7-1,EOMONTH(Tabla2[[#This Row],[Mes Intereses]],0),\"d\"),DAY(EOMONTH(D301,0)))),DATEDIF(MAX($F$7,Tabla2[[#This Row],[Mes Intereses]]),$F$9+1,\"d\")),0)","v":0},{"$f":"IFERROR(ROUND(Tabla2[[#This Row],[% var. \nÍndice RIPTE computable]]/DAY(EOMONTH(Tabla2[[#This Row],[Mes Intereses]],0))*Tabla2[[#This Row],[Dias de \nintereses]],4),\"índice no publicado\")","v":0}]
[null,null,null,"2026-03-01","índice no publicado",186718.83,{"$f":"IFERROR(ROUND(Tabla2[[#This Row],[Índice RIPTE computable]]/F301-1,4),\"índice no públicado\")","v":1.35E-2},{"$f":"IFERROR(IF($F$9>(EOMONTH(Tabla2[[#This Row],[Mes Intereses]],0)),(MIN(DATEDIF($F$7-1,EOMONTH(Tabla2[[#This Row],[Mes Intereses]],0),\"d\"),DAY(EOMONTH(D302,0)))),DATEDIF(MAX($F$7,Tabla2[[#This Row],[Mes Intereses]]),$F$9+1,\"d\")),0)","v":0},{"$f":"IFERROR(ROUND(Tabla2[[#This Row],[% var. \nÍndice RIPTE computable]]/DAY(EOMONTH(Tabla2[[#This Row],[Mes Intereses]],0))*Tabla2[[#This Row],[Dias de \nintereses]],4),\"índice no publicado\")","v":0}]
[null,null,null,"2026-04-01","índice no publicado",188181.62,{"$f":"IFERROR(ROUND(Tabla2[[#This Row],[Índice RIPTE computable]]/F302-1,4),\"índice no públicado\")","v":7.7999999999999996E-3},{"$f":"IFERROR(IF($F$9>(EOMONTH(Tabla2[[#This Row],[Mes Intereses]],0)),(MIN(DATEDIF($F$7-1,EOMONTH(Tabla2[[#This Row],[Mes Intereses]],0),\"d\"),DAY(EOMONTH(D303,0)))),DATEDIF(MAX($F$7,Tabla2[[#This Row],[Mes Intereses]]),$F$9+1,\"d\")),0)","v":0},{"$f":"IFERROR(ROUND(Tabla2[[#This Row],[% var. \nÍndice RIPTE computable]]/DAY(EOMONTH(Tabla2[[#This Row],[Mes Intereses]],0))*Tabla2[[#This Row],[Dias de \nintereses]],4),\"índice no publicado\")","v":0}]
[null,null,null,"2026-05-01","índice no publicado","índice no publicado",{"$f":"IFERROR(ROUND(Tabla2[[#This Row],[Índice RIPTE computable]]/F303-1,4),\"índice no públicado\")","v":"índice no públicado"},{"$f":"IFERROR(IF($F$9>(EOMONTH(Tabla2[[#This Row],[Mes Intereses]],0)),(MIN(DATEDIF($F$7-1,EOMONTH(Tabla2[[#This Row],[Mes Intereses]],0),\"d\"),DAY(EOMONTH(D304,0)))),DATEDIF(MAX($F$7,Tabla2[[#This Row],[Mes Intereses]]),$F$9+1,\"d\")),0)","v":0},{"$f":"IFERROR(ROUND(Tabla2[[#This Row],[% var. \nÍndice RIPTE computable]]/DAY(EOMONTH(Tabla2[[#This Row],[Mes Intereses]],0))*Tabla2[[#This Row],[Dias de \nintereses]],4),\"índice no publicado\")","v":"índice no publicado"}]
[null,null,null,"2026-06-01","índice no publicado","índice no publicado",{"$f":"IFERROR(ROUND(Tabla2[[#This Row],[Índice RIPTE computable]]/F304-1,4),\"índice no públicado\")","v":"índice no públicado"},{"$f":"IFERROR(IF($F$9>(EOMONTH(Tabla2[[#This Row],[Mes Intereses]],0)),(MIN(DATEDIF($F$7-1,EOMONTH(Tabla2[[#This Row],[Mes Intereses]],0),\"d\"),DAY(EOMONTH(D305,0)))),DATEDIF(MAX($F$7,Tabla2[[#This Row],[Mes Intereses]]),$F$9+1,\"d\")),0)","v":0},{"$f":"IFERROR(ROUND(Tabla2[[#This Row],[% var. \nÍndice RIPTE computable]]/DAY(EOMONTH(Tabla2[[#This Row],[Mes Intereses]],0))*Tabla2[[#This Row],[Dias de \nintereses]],4),\"índice no publicado\")","v":"índice no publicado"}]
[null,null,null,"2026-07-01","índice no publicado","índice no publicado",{"$f":"IFERROR(ROUND(Tabla2[[#This Row],[Índice RIPTE computable]]/F305-1,4),\"índice no públicado\")","v":"índice no públicado"},{"$f":"IFERROR(IF($F$9>(EOMONTH(Tabla2[[#This Row],[Mes Intereses]],0)),(MIN(DATEDIF($F$7-1,EOMONTH(Tabla2[[#This Row],[Mes Intereses]],0),\"d\"),DAY(EOMONTH(D306,0)))),DATEDIF(MAX($F$7,Tabla2[[#This Row],[Mes Intereses]]),$F$9+1,\"d\")),0)","v":0},{"$f":"IFERROR(ROUND(Tabla2[[#This Row],[% var. \nÍndice RIPTE computable]]/DAY(EOMONTH(Tabla2[[#This Row],[Mes Intereses]],0))*Tabla2[[#This Row],[Dias de \nintereses]],4),\"índice no publicado\")","v":"índice no publicado"}]
[null,null,null,"2026-08-01","índice no publicado","índice no publicado",{"$f":"IFERROR(ROUND(Tabla2[[#This Row],[Índice RIPTE computable]]/F306-1,4),\"índice no públicado\")","v":"índice no públicado"},{"$f":"IFERROR(IF($F$9>(EOMONTH(Tabla2[[#This Row],[Mes Intereses]],0)),(MIN(DATEDIF($F$7-1,EOMONTH(Tabla2[[#This Row],[Mes Intereses]],0),\"d\"),DAY(EOMONTH(D307,0)))),DATEDIF(MAX($F$7,Tabla2[[#This Row],[Mes Intereses]]),$F$9+1,\"d\")),0)","v":0},{"$f":"IFERROR(ROUND(Tabla2[[#This Row],[% var. \nÍndice RIPTE computable]]/DAY(EOMONTH(Tabla2[[#This Row],[Mes Intereses]],0))*Tabla2[[#This Row],[Dias de \nintereses]],4),\"índice no publicado\")","v":"índice no publicado"}]
[null,null,null,"2026-09-01","índice no publicado","índice no publicado",{"$f":"IFERROR(ROUND(Tabla2[[#This Row],[Índice RIPTE computable]]/F307-1,4),\"índice no públicado\")","v":"índice no públicado"},{"$f":"IFERROR(IF($F$9>(EOMONTH(Tabla2[[#This Row],[Mes Intereses]],0)),(MIN(DATEDIF($F$7-1,EOMONTH(Tabla2[[#This Row],[Mes Intereses]],0),\"d\"),DAY(EOMONTH(D308,0)))),DATEDIF(MAX($F$7,Tabla2[[#This Row],[Mes Intereses]]),$F$9+1,\"d\")),0)","v":0},{"$f":"IFERROR(ROUND(Tabla2[[#This Row],[% var. \nÍndice RIPTE computable]]/DAY(EOMONTH(Tabla2[[#This Row],[Mes Intereses]],0))*Tabla2[[#This Row],[Dias de \nintereses]],4),\"índice no publicado\")","v":"índice no publicado"}]
[null,null,null,"2026-10-01","índice no publicado","índice no publicado",{"$f":"IFERROR(ROUND(Tabla2[[#This Row],[Índice RIPTE computable]]/F308-1,4),\"índice no públicado\")","v":"índice no públicado"},{"$f":"IFERROR(IF($F$9>(EOMONTH(Tabla2[[#This Row],[Mes Intereses]],0)),(MIN(DATEDIF($F$7-1,EOMONTH(Tabla2[[#This Row],[Mes Intereses]],0),\"d\"),DAY(EOMONTH(D309,0)))),DATEDIF(MAX($F$7,Tabla2[[#This Row],[Mes Intereses]]),$F$9+1,\"d\")),0)","v":0},{"$f":"IFERROR(ROUND(Tabla2[[#This Row],[% var. \nÍndice RIPTE computable]]/DAY(EOMONTH(Tabla2[[#This Row],[Mes Intereses]],0))*Tabla2[[#This Row],[Dias de \nintereses]],4),\"índice no publicado\")","v":"índice no publicado"}]
[null,null,null,"2026-11-01","índice no publicado","índice no publicado",{"$f":"IFERROR(ROUND(Tabla2[[#This Row],[Índice RIPTE computable]]/F309-1,4),\"índice no públicado\")","v":"índice no públicado"},{"$f":"IFERROR(IF($F$9>(EOMONTH(Tabla2[[#This Row],[Mes Intereses]],0)),(MIN(DATEDIF($F$7-1,EOMONTH(Tabla2[[#This Row],[Mes Intereses]],0),\"d\"),DAY(EOMONTH(D310,0)))),DATEDIF(MAX($F$7,Tabla2[[#This Row],[Mes Intereses]]),$F$9+1,\"d\")),0)","v":0},{"$f":"IFERROR(ROUND(Tabla2[[#This Row],[% var. \nÍndice RIPTE computable]]/DAY(EOMONTH(Tabla2[[#This Row],[Mes Intereses]],0))*Tabla2[[#This Row],[Dias de \nintereses]],4),\"índice no publicado\")","v":"índice no publicado"}]
[null,null,null,"2026-12-01","índice no publicado","índice no publicado",{"$f":"IFERROR(ROUND(Tabla2[[#This Row],[Índice RIPTE computable]]/F310-1,4),\"índice no públicado\")","v":"índice no públicado"},{"$f":"IFERROR(IF($F$9>(EOMONTH(Tabla2[[#This Row],[Mes Intereses]],0)),(MIN(DATEDIF($F$7-1,EOMONTH(Tabla2[[#This Row],[Mes Intereses]],0),\"d\"),DAY(EOMONTH(D311,0)))),DATEDIF(MAX($F$7,Tabla2[[#This Row],[Mes Intereses]]),$F$9+1,\"d\")),0)","v":0},{"$f":"IFERROR(ROUND(Tabla2[[#This Row],[% var. \nÍndice RIPTE computable]]/DAY(EOMONTH(Tabla2[[#This Row],[Mes Intereses]],0))*Tabla2[[#This Row],[Dias de \nintereses]],4),\"índice no publicado\")","v":"índice no publicado"}]

{"sheet":"Piso mín.","index":1,"n_rows":3531,"n_cols":9,"rows_kept":3531,"cut":false,"hidden":false,"merged":[]}
[null,null,"Fecha","Piso mínimo","art. 11 inc. a)","art. 1 inc. b)","art. 11 inc. c)","Piso art. 3","Fuente"]
[null,null,"2017-01-01",1090945,484865,606081,727297,206602,"Res. 387/16*"]
[null,null,"2017-01-02",1090945,484865,606081,727297,206602,"Res. 387/16*"]
[null,null,"2017-01-03",1090945,484865,606081,727297,206602,"Res. 387/16*"]
[null,null,"2017-01-04",1090945,484865,606081,727297,206602,"Res. 387/16*"]
[null,null,"2017-01-05",1090945,484865,606081,727297,206602,"Res. 387/16*"]
[null,null,"2017-01-06",1090945,484865,606081,727297,206602,"Res. 387/16*"]
[null,null,"2017-01-07",1090945,484865,606081,727297,206602,"Res. 387/16*"]
[null,null,"2017-01-08",1090945,484865,606081,727297,206602,"Res. 387/16*"]
[null,null,"2017-01-09",1090945,484865,606081,727297,206602,"Res. 387/16*"]
[null,null,"2017-01-10",1090945,484865,606081,727297,206602,"Res. 387/16*"]
[null,null,"2017-01-11",1090945,484865,606081,727297,206602,"Res. 387/16*"]
[null,null,"2017-01-12",1090945,484865,606081,727297,206602,"Res. 387/16*"]
[null,null,"2017-01-13",1090945,484865,606081,727297,206602,"Res. 387/16*"]
[null,null,"2017-01-14",1090945,484865,606081,727297,206602,"Res. 387/16*"]
[null,null,"2017-01-15",1090945,484865,606081,727297,206602,"Res. 387/16*"]
[null,null,"2017-01-16",1090945,484865,606081,727297,206602,"Res. 387/16*"]
[null,null,"2017-01-17",1090945,484865,606081,727297,206602,"Res. 387/16*"]
[null,null,"2017-01-18",1090945,484865,606081,727297,206602,"Res. 387/16*"]
[null,null,"2017-01-19",1090945,484865,606081,727297,206602,"Res. 387/16*"]
[null,null,"2017-01-20",1090945,484865,606081,727297,206602,"Res. 387/16*"]
[null,null,"2017-01-21",1090945,484865,606081,727297,206602,"Res. 387/16*"]
[null,null,"2017-01-22",1090945,484865,606081,727297,206602,"Res. 387/16*"]
[null,null,"2017-01-23",1090945,484865,606081,727297,206602,"Res. 387/16*"]
[null,null,"2017-01-24",1090945,484865,606081,727297,206602,"Res. 387/16*"]
[null,null,"2017-01-25",1090945,484865,606081,727297,206602,"Res. 387/16*"]
[null,null,"2017-01-26",1090945,484865,606081,727297,206602,"Res. 387/16*"]
[null,null,"2017-01-27",1090945,484865,606081,727297,206602,"Res. 387/16*"]
[null,null,"2017-01-28",1090945,484865,606081,727297,206602,"Res. 387/16*"]
[null,null,"2017-01-29",1090945,484865,606081,727297,206602,"Res. 387/16*"]
[null,null,"2017-01-30",1090945,484865,606081,727297,206602,"Res. 387/16*"]
[null,null,"2017-01-31",1090945,484865,606081,727297,206602,"Res. 387/16*"]
[null,null,"2017-02-01",1090945,484865,606081,727297,206602,"Res. 387/16*"]
[null,null,"2017-02-02",1090945,484865,606081,727297,206602,"Res. 387/16*"]
[null,null,"2017-02-03",1090945,484865,606081,727297,206602,"Res. 387/16*"]
[null,null,"2017-02-04",1090945,484865,606081,727297,206602,"Res. 387/16*"]
[null,null,"2017-02-05",1090945,484865,606081,727297,206602,"Res. 387/16*"]
[null,null,"2017-02-06",1090945,484865,606081,727297,206602,"Res. 387/16*"]
[null,null,"2017-02-07",1090945,484865,606081,727297,206602,"Res. 387/16*"]
[null,null,"2017-02-08",1090945,484865,606081,727297,206602,"Res. 387/16*"]
[null,null,"2017-02-09",1090945,484865,606081,727297,206602,"Res. 387/16*"]
[null,null,"2017-02-10",1090945,484865,606081,727297,206602,"Res. 387/16*"]
[null,null,"2017-02-11",1090945,484865,606081,727297,206602,"Res. 387/16*"]
[null,null,"2017-02-12",1090945,484865,606081,727297,206602,"Res. 387/16*"]
[null,null,"2017-02-13",1090945,484865,606081,727297,206602,"Res. 387/16*"]
[null,null,"2017-02-14",1090945,484865,606081,727297,206602,"Res. 387/16*"]
[null,null,"2017-02-15",1090945,484865,606081,727297,206602,"Res. 387/16*"]
[null,null,"2017-02-16",1090945,484865,606081,727297,206602,"Res. 387/16*"]
[null,null,"2017-02-17",1090945,484865,606081,727297,206602,"Res. 387/16*"]
[null,null,"2017-02-18",1090945,484865,606081,727297,206602,"Res. 387/16*"]
[null,null,"2017-02-19",1090945,484865,606081,727297,206602,"Res. 387/16*"]
[null,null,"2017-02-20",1090945,484865,606081,727297,206602,"Res. 387/16*"]
[null,null,"2017-02-21",1090945,484865,606081,727297,206602,"Res. 387/16*"]
[null,null,"2017-02-22",1090945,484865,606081,727297,206602,"Res. 387/16*"]
[null,null,"2017-02-23",1090945,484865,606081,727297,206602,"Res. 387/16*"]
[null,null,"2017-02-24",1090945,484865,606081,727297,206602,"Res. 387/16*"]
[null,null,"2017-02-25",1090945,484865,606081,727297,206602,"Res. 387/16*"]
[null,null,"2017-02-26",1090945,484865,606081,727297,206602,"Res. 387/16*"]
[null,null,"2017-02-27",1090945,484865,606081,727297,206602,"Res. 387/16*"]
[null,null,"2017-02-28",1090945,484865,606081,727297,206602,"Res. 387/16*"]
[null,null,"2017-03-01",1234944,548864,686080,823296,233872,"Nota S.C.E. 5649/17**"]
[null,null,"2017-03-02",1234944,548864,686080,823296,233872,"Nota S.C.E. 5649/17**"]
[null,null,"2017-03-03",1234944,548864,686080,823296,233872,"Nota S.C.E. 5649/17**"]
[null,null,"2017-03-04",1234944,548864,686080,823296,233872,"Nota S.C.E. 5649/17**"]
[null,null,"2017-03-05",1234944,548864,686080,823296,233872,"Nota S.C.E. 5649/17**"]
[null,null,"2017-03-06",1234944,548864,686080,823296,233872,"Nota S.C.E. 5649/17**"]
[null,null,"2017-03-07",1234944,548864,686080,823296,233872,"Nota S.C.E. 5649/17**"]
[null,null,"2017-03-08",1234944,548864,686080,823296,233872,"Nota S.C.E. 5649/17**"]
[null,null,"2017-03-09",1234944,548864,686080,823296,233872,"Nota S.C.E. 5649/17**"]
[null,null,"2017-03-10",1234944,548864,686080,823296,233872,"Nota S.C.E. 5649/17**"]
[null,null,"2017-03-11",1234944,548864,686080,823296,233872,"Nota S.C.E. 5649/17**"]
[null,null,"2017-03-12",1234944,548864,686080,823296,233872,"Nota S.C.E. 5649/17**"]
[null,null,"2017-03-13",1234944,548864,686080,823296,233872,"Nota S.C.E. 5649/17**"]
[null,null,"2017-03-14",1234944,548864,686080,823296,233872,"Nota S.C.E. 5649/17**"]
[null,null,"2017-03-15",1234944,548864,686080,823296,233872,"Nota S.C.E. 5649/17**"]
[null,null,"2017-03-16",1234944,548864,686080,823296,233872,"Nota S.C.E. 5649/17**"]
[null,null,"2017-03-17",1234944,548864,686080,823296,233872,"Nota S.C.E. 5649/17**"]
[null,null,"2017-03-18",1234944,548864,686080,823296,233872,"Nota S.C.E. 5649/17**"]
[null,null,"2017-03-19",1234944,548864,686080,823296,233872,"Nota S.C.E. 5649/17**"]
[null,null,"2017-03-20",1234944,548864,686080,823296,233872,"Nota S.C.E. 5649/17**"]
[null,null,"2017-03-21",1234944,548864,686080,823296,233872,"Nota S.C.E. 5649/17**"]
[null,null,"2017-03-22",1234944,548864,686080,823296,233872,"Nota S.C.E. 5649/17**"]
[null,null,"2017-03-23",1234944,548864,686080,823296,233872,"Nota S.C.E. 5649/17**"]
[null,null,"2017-03-24",1234944,548864,686080,823296,233872,"Nota S.C.E. 5649/17**"]
[null,null,"2017-03-25",1234944,548864,686080,823296,233872,"Nota S.C.E. 5649/17**"]
[null,null,"2017-03-26",1234944,548864,686080,823296,233872,"Nota S.C.E. 5649/17**"]
[null,null,"2017-03-27",1234944,548864,686080,823296,233872,"Nota S.C.E. 5649/17**"]
[null,null,"2017-03-28",1234944,548864,686080,823296,233872,"Nota S.C.E. 5649/17**"]
[null,null,"2017-03-29",1234944,548864,686080,823296,233872,"Nota S.C.E. 5649/17**"]
[null,null,"2017-03-30",1234944,548864,686080,823296,233872,"Nota S.C.E. 5649/17**"]
[null,null,"2017-03-31",1234944,548864,686080,823296,233872,"Nota S.C.E. 5649/17**"]
[null,null,"2017-04-01",1234944,548864,686080,823296,233872,"Nota S.C.E. 5649/17**"]
[null,null,"2017-04-02",1234944,548864,686080,823296,233872,"Nota S.C.E. 5649/17**"]
[null,null,"2017-04-03",1234944,548864,686080,823296,233872,"Nota S.C.E. 5649/17**"]
[null,null,"2017-04-04",1234944,548864,686080,823296,233872,"Nota S.C.E. 5649/17**"]
[null,null,"2017-04-05",1234944,548864,686080,823296,233872,"Nota S.C.E. 5649/17**"]
[null,null,"2017-04-06",1234944,548864,686080,823296,233872,"Nota S.C.E. 5649/17**"]
[null,null,"2017-04-07",1234944,548864,686080,823296,233872,"Nota S.C.E. 5649/17**"]
[null,null,"2017-04-08",1234944,548864,686080,823296,233872,"Nota S.C.E. 5649/17**"]
[null,null,"2017-04-09",1234944,548864,686080,823296,233872,"Nota S.C.E. 5649/17**"]
[null,null,"2017-04-10",1234944,548864,686080,823296,233872,"Nota S.C.E. 5649/17**"]
[null,null,"2017-04-11",1234944,548864,686080,823296,233872,"Nota S.C.E. 5649/17**"]
[null,null,"2017-04-12",1234944,548864,686080,823296,233872,"Nota S.C.E. 5649/17**"]
[null,null,"2017-04-13",1234944,548864,686080,823296,233872,"Nota S.C.E. 5649/17**"]
[null,null,"2017-04-14",1234944,548864,686080,823296,233872,"Nota S.C.E. 5649/17**"]
[null,null,"2017-04-15",1234944,548864,686080,823296,233872,"Nota S.C.E. 5649/17**"]
[null,null,"2017-04-16",1234944,548864,686080,823296,233872,"Nota S.C.E. 5649/17**"]
[null,null,"2017-04-17",1234944,548864,686080,823296,233872,"Nota S.C.E. 5649/17**"]
[null,null,"2017-04-18",1234944,548864,686080,823296,233872,"Nota S.C.E. 5649/17**"]
[null,null,"2017-04-19",1234944,548864,686080,823296,233872,"Nota S.C.E. 5649/17**"]
[null,null,"2017-04-20",1234944,548864,686080,823296,233872,"Nota S.C.E. 5649/17**"]
[null,null,"2017-04-21",1234944,548864,686080,823296,233872,"Nota S.C.E. 5649/17**"]
[null,null,"2017-04-22",1234944,548864,686080,823296,233872,"Nota S.C.E. 5649/17**"]
[null,null,"2017-04-23",1234944,548864,686080,823296,233872,"Nota S.C.E. 5649/17**"]
[null,null,"2017-04-24",1234944,548864,686080,823296,233872,"Nota S.C.E. 5649/17**"]
[null,null,"2017-04-25",1234944,548864,686080,823296,233872,"Nota S.C.E. 5649/17**"]
[null,null,"2017-04-26",1234944,548864,686080,823296,233872,"Nota S.C.E. 5649/17**"]
[null,null,"2017-04-27",1234944,548864,686080,823296,233872,"Nota S.C.E. 5649/17**"]
[null,null,"2017-04-28",1234944,548864,686080,823296,233872,"Nota S.C.E. 5649/17**"]
[null,null,"2017-04-29",1234944,548864,686080,823296,233872,"Nota S.C.E. 5649/17**"]
[null,null,"2017-04-30",1234944,548864,686080,823296,233872,"Nota S.C.E. 5649/17**"]
[null,null,"2017-05-01",1234944,548864,686080,823296,233872,"Nota S.C.E. 5649/17**"]
[null,null,"2017-05-02",1234944,548864,686080,823296,233872,"Nota S.C.E. 5649/17**"]
[null,null,"2017-05-03",1234944,548864,686080,823296,233872,"Nota S.C.E. 5649/17**"]
[null,null,"2017-05-04",1234944,548864,686080,823296,233872,"Nota S.C.E. 5649/17**"]
[null,null,"2017-05-05",1234944,548864,686080,823296,233872,"Nota S.C.E. 5649/17**"]
[null,null,"2017-05-06",1234944,548864,686080,823296,233872,"Nota S.C.E. 5649/17**"]
[null,null,"2017-05-07",1234944,548864,686080,823296,233872,"Nota S.C.E. 5649/17**"]
[null,null,"2017-05-08",1234944,548864,686080,823296,233872,"Nota S.C.E. 5649/17**"]
[null,null,"2017-05-09",1234944,548864,686080,823296,233872,"Nota S.C.E. 5649/17**"]
[null,null,"2017-05-10",1234944,548864,686080,823296,233872,"Nota S.C.E. 5649/17**"]
[null,null,"2017-05-11",1234944,548864,686080,823296,233872,"Nota S.C.E. 5649/17**"]
[null,null,"2017-05-12",1234944,548864,686080,823296,233872,"Nota S.C.E. 5649/17**"]
[null,null,"2017-05-13",1234944,548864,686080,823296,233872,"Nota S.C.E. 5649/17**"]
[null,null,"2017-05-14",1234944,548864,686080,823296,233872,"Nota S.C.E. 5649/17**"]
[null,null,"2017-05-15",1234944,548864,686080,823296,233872,"Nota S.C.E. 5649/17**"]
[null,null,"2017-05-16",1234944,548864,686080,823296,233872,"Nota S.C.E. 5649/17**"]
[null,null,"2017-05-17",1234944,548864,686080,823296,233872,"Nota S.C.E. 5649/17**"]
[null,null,"2017-05-18",1234944,548864,686080,823296,233872,"Nota S.C.E. 5649/17**"]
[null,null,"2017-05-19",1234944,548864,686080,823296,233872,"Nota S.C.E. 5649/17**"]
[null,null,"2017-05-20",1234944,548864,686080,823296,233872,"Nota S.C.E. 5649/17**"]
[null,null,"2017-05-21",1234944,548864,686080,823296,233872,"Nota S.C.E. 5649/17**"]
[null,null,"2017-05-22",1234944,548864,686080,823296,233872,"Nota S.C.E. 5649/17**"]
[null,null,"2017-05-23",1234944,548864,686080,823296,233872,"Nota S.C.E. 5649/17**"]
[null,null,"2017-05-24",1234944,548864,686080,823296,233872,"Nota S.C.E. 5649/17**"]
[null,null,"2017-05-25",1234944,548864,686080,823296,233872,"Nota S.C.E. 5649/17**"]
[null,null,"2017-05-26",1234944,548864,686080,823296,233872,"Nota S.C.E. 5649/17**"]
[null,null,"2017-05-27",1234944,548864,686080,823296,233872,"Nota S.C.E. 5649/17**"]
[null,null,"2017-05-28",1234944,548864,686080,823296,233872,"Nota S.C.E. 5649/17**"]
[null,null,"2017-05-29",1234944,548864,686080,823296,233872,"Nota S.C.E. 5649/17**"]
[null,null,"2017-05-30",1234944,548864,686080,823296,233872,"Nota S.C.E. 5649/17**"]
[null,null,"2017-05-31",1234944,548864,686080,823296,233872,"Nota S.C.E. 5649/17**"]
[null,null,"2017-06-01",1234944,548864,686080,823296,233872,"Nota S.C.E. 5649/17**"]
[null,null,"2017-06-02",1234944,548864,686080,823296,233872,"Nota S.C.E. 5649/17**"]
[null,null,"2017-06-03",1234944,548864,686080,823296,233872,"Nota S.C.E. 5649/17**"]
[null,null,"2017-06-04",1234944,548864,686080,823296,233872,"Nota S.C.E. 5649/17**"]
[null,null,"2017-06-05",1234944,548864,686080,823296,233872,"Nota S.C.E. 5649/17**"]
[null,null,"2017-06-06",1234944,548864,686080,823296,233872,"Nota S.C.E. 5649/17**"]
[null,null,"2017-06-07",1234944,548864,686080,823296,233872,"Nota S.C.E. 5649/17**"]
[null,null,"2017-06-08",1234944,548864,686080,823296,233872,"Nota S.C.E. 5649/17**"]
[null,null,"2017-06-09",1234944,548864,686080,823296,233872,"Nota S.C.E. 5649/17**"]
[null,null,"2017-06-10",1234944,548864,686080,823296,233872,"Nota S.C.E. 5649/17**"]
[null,null,"2017-06-11",1234944,548864,686080,823296,233872,"Nota S.C.E. 5649/17**"]
[null,null,"2017-06-12",1234944,548864,686080,823296,233872,"Nota S.C.E. 5649/17**"]
[null,null,"2017-06-13",1234944,548864,686080,823296,233872,"Nota S.C.E. 5649/17**"]
[null,null,"2017-06-14",1234944,548864,686080,823296,233872,"Nota S.C.E. 5649/17**"]
[null,null,"2017-06-15",1234944,548864,686080,823296,233872,"Nota S.C.E. 5649/17**"]
[null,null,"2017-06-16",1234944,548864,686080,823296,233872,"Nota S.C.E. 5649/17**"]
[null,null,"2017-06-17",1234944,548864,686080,823296,233872,"Nota S.C.E. 5649/17**"]
[null,null,"2017-06-18",1234944,548864,686080,823296,233872,"Nota S.C.E. 5649/17**"]
[null,null,"2017-06-19",1234944,548864,686080,823296,233872,"Nota S.C.E. 5649/17**"]
[null,null,"2017-06-20",1234944,548864,686080,823296,233872,"Nota S.C.E. 5649/17**"]
[null,null,"2017-06-21",1234944,548864,686080,823296,233872,"Nota S.C.E. 5649/17**"]
[null,null,"2017-06-22",1234944,548864,686080,823296,233872,"Nota S.C.E. 5649/17**"]
[null,null,"2017-06-23",1234944,548864,686080,823296,233872,"Nota S.C.E. 5649/17**"]
[null,null,"2017-06-24",1234944,548864,686080,823296,233872,"Nota S.C.E. 5649/17**"]
[null,null,"2017-06-25",1234944,548864,686080,823296,233872,"Nota S.C.E. 5649/17**"]
[null,null,"2017-06-26",1234944,548864,686080,823296,233872,"Nota S.C.E. 5649/17**"]
[null,null,"2017-06-27",1234944,548864,686080,823296,233872,"Nota S.C.E. 5649/17**"]
[null,null,"2017-06-28",1234944,548864,686080,823296,233872,"Nota S.C.E. 5649/17**"]
[null,null,"2017-06-29",1234944,548864,686080,823296,233872,"Nota S.C.E. 5649/17**"]
[null,null,"2017-06-30",1234944,548864,686080,823296,233872,"Nota S.C.E. 5649/17**"]
[null,null,"2017-07-01",1234944,548864,686080,823296,233872,"Nota S.C.E. 5649/17**"]
[null,null,"2017-07-02",1234944,548864,686080,823296,233872,"Nota S.C.E. 5649/17**"]
[null,null,"2017-07-03",1234944,548864,686080,823296,233872,"Nota S.C.E. 5649/17**"]
[null,null,"2017-07-04",1234944,548864,686080,823296,233872,"Nota S.C.E. 5649/17**"]
[null,null,"2017-07-05",1234944,548864,686080,823296,233872,"Nota S.C.E. 5649/17**"]
[null,null,"2017-07-06",1234944,548864,686080,823296,233872,"Nota S.C.E. 5649/17**"]
[null,null,"2017-07-07",1234944,548864,686080,823296,233872,"Nota S.C.E. 5649/17**"]
[null,null,"2017-07-08",1234944,548864,686080,823296,233872,"Nota S.C.E. 5649/17**"]
[null,null,"2017-07-09",1234944,548864,686080,823296,233872,"Nota S.C.E. 5649/17**"]
[null,null,"2017-07-10",1234944,548864,686080,823296,233872,"Nota S.C.E. 5649/17**"]
[null,null,"2017-07-11",1234944,548864,686080,823296,233872,"Nota S.C.E. 5649/17**"]
[null,null,"2017-07-12",1234944,548864,686080,823296,233872,"Nota S.C.E. 5649/17**"]
[null,null,"2017-07-13",1234944,548864,686080,823296,233872,"Nota S.C.E. 5649/17**"]
[null,null,"2017-07-14",1234944,548864,686080,823296,233872,"Nota S.C.E. 5649/17**"]
[null,null,"2017-07-15",1234944,548864,686080,823296,233872,"Nota S.C.E. 5649/17**"]
[null,null,"2017-07-16",1234944,548864,686080,823296,233872,"Nota S.C.E. 5649/17**"]
[null,null,"2017-07-17",1234944,548864,686080,823296,233872,"Nota S.C.E. 5649/17**"]
[null,null,"2017-07-18",1234944,548864,686080,823296,233872,"Nota S.C.E. 5649/17**"]
[null,null,"2017-07-19",1234944,548864,686080,823296,233872,"Nota S.C.E. 5649/17**"]
[null,null,"2017-07-20",1234944,548864,686080,823296,233872,"Nota S.C.E. 5649/17**"]
[null,null,"2017-07-21",1234944,548864,686080,823296,233872,"Nota S.C.E. 5649/17**"]
[null,null,"2017-07-22",1234944,548864,686080,823296,233872,"Nota S.C.E. 5649/17**"]
[null,null,"2017-07-23",1234944,548864,686080,823296,233872,"Nota S.C.E. 5649/17**"]
[null,null,"2017-07-24",1234944,548864,686080,823296,233872,"Nota S.C.E. 5649/17**"]
[null,null,"2017-07-25",1234944,548864,686080,823296,233872,"Nota S.C.E. 5649/17**"]
[null,null,"2017-07-26",1234944,548864,686080,823296,233872,"Nota S.C.E. 5649/17**"]
[null,null,"2017-07-27",1234944,548864,686080,823296,233872,"Nota S.C.E. 5649/17**"]
[null,null,"2017-07-28",1234944,548864,686080,823296,233872,"Nota S.C.E. 5649/17**"]
[null,null,"2017-07-29",1234944,548864,686080,823296,233872,"Nota S.C.E. 5649/17**"]
[null,null,"2017-07-30",1234944,548864,686080,823296,233872,"Nota S.C.E. 5649/17**"]
[null,null,"2017-07-31",1234944,548864,686080,823296,233872,"Nota S.C.E. 5649/17**"]
[null,null,"2017-08-01",1234944,548864,686080,823296,233872,"Nota S.C.E. 5649/17**"]
[null,null,"2017-08-02",1234944,548864,686080,823296,233872,"Nota S.C.E. 5649/17**"]
[null,null,"2017-08-03",1234944,548864,686080,823296,233872,"Nota S.C.E. 5649/17**"]
[null,null,"2017-08-04",1234944,548864,686080,823296,233872,"Nota S.C.E. 5649/17**"]
[null,null,"2017-08-05",1234944,548864,686080,823296,233872,"Nota S.C.E. 5649/17**"]
[null,null,"2017-08-06",1234944,548864,686080,823296,233872,"Nota S.C.E. 5649/17**"]
[null,null,"2017-08-07",1234944,548864,686080,823296,233872,"Nota S.C.E. 5649/17**"]
[null,null,"2017-08-08",1234944,548864,686080,823296,233872,"Nota S.C.E. 5649/17**"]
[null,null,"2017-08-09",1234944,548864,686080,823296,233872,"Nota S.C.E. 5649/17**"]
[null,null,"2017-08-10",1234944,548864,686080,823296,233872,"Nota S.C.E. 5649/17**"]
[null,null,"2017-08-11",1234944,548864,686080,823296,233872,"Nota S.C.E. 5649/17**"]
[null,null,"2017-08-12",1234944,548864,686080,823296,233872,"Nota S.C.E. 5649/17**"]
[null,null,"2017-08-13",1234944,548864,686080,823296,233872,"Nota S.C.E. 5649/17**"]
[null,null,"2017-08-14",1234944,548864,686080,823296,233872,"Nota S.C.E. 5649/17**"]
[null,null,"2017-08-15",1234944,548864,686080,823296,233872,"Nota S.C.E. 5649/17**"]
[null,null,"2017-08-16",1234944,548864,686080,823296,233872,"Nota S.C.E. 5649/17**"]
[null,null,"2017-08-17",1234944,548864,686080,823296,233872,"Nota S.C.E. 5649/17**"]
[null,null,"2017-08-18",1234944,548864,686080,823296,233872,"Nota S.C.E. 5649/17**"]
[null,null,"2017-08-19",1234944,548864,686080,823296,233872,"Nota S.C.E. 5649/17**"]
[null,null,"2017-08-20",1234944,548864,686080,823296,233872,"Nota S.C.E. 5649/17**"]
[null,null,"2017-08-21",1234944,548864,686080,823296,233872,"Nota S.C.E. 5649/17**"]
[null,null,"2017-08-22",1234944,548864,686080,823296,233872,"Nota S.C.E. 5649/17**"]
[null,null,"2017-08-23",1234944,548864,686080,823296,233872,"Nota S.C.E. 5649/17**"]
[null,null,"2017-08-24",1234944,548864,686080,823296,233872,"Nota S.C.E. 5649/17**"]
[null,null,"2017-08-25",1234944,548864,686080,823296,233872,"Nota S.C.E. 5649/17**"]
[null,null,"2017-08-26",1234944,548864,686080,823296,233872,"Nota S.C.E. 5649/17**"]
[null,null,"2017-08-27",1234944,548864,686080,823296,233872,"Nota S.C.E. 5649/17**"]
[null,null,"2017-08-28",1234944,548864,686080,823296,233872,"Nota S.C.E. 5649/17**"]
[null,null,"2017-08-29",1234944,548864,686080,823296,233872,"Nota S.C.E. 5649/17**"]
[null,null,"2017-08-30",1234944,548864,686080,823296,233872,"Nota S.C.E. 5649/17**"]
[null,null,"2017-08-31",1234944,548864,686080,823296,233872,"Nota S.C.E. 5649/17**"]
[null,null,"2017-09-01",1400864,622606,778258,933910,265294,"Nota S.C.E. 21161/17"]
[null,null,"2017-09-02",1400864,622606,778258,933910,265294,"Nota S.C.E. 21161/18"]
[null,null,"2017-09-03",1400864,622606,778258,933910,265294,"Nota S.C.E. 21161/19"]
[null,null,"2017-09-04",1400864,622606,778258,933910,265294,"Nota S.C.E. 21161/20"]
[null,null,"2017-09-05",1400864,622606,778258,933910,265294,"Nota S.C.E. 21161/21"]
[null,null,"2017-09-06",1400864,622606,778258,933910,265294,"Nota S.C.E. 21161/22"]
[null,null,"2017-09-07",1400864,622606,778258,933910,265294,"Nota S.C.E. 21161/23"]
[null,null,"2017-09-08",1400864,622606,778258,933910,265294,"Nota S.C.E. 21161/24"]
[null,null,"2017-09-09",1400864,622606,778258,933910,265294,"Nota S.C.E. 21161/25"]
[null,null,"2017-09-10",1400864,622606,778258,933910,265294,"Nota S.C.E. 21161/26"]
[null,null,"2017-09-11",1400864,622606,778258,933910,265294,"Nota S.C.E. 21161/27"]
[null,null,"2017-09-12",1400864,622606,778258,933910,265294,"Nota S.C.E. 21161/28"]
[null,null,"2017-09-13",1400864,622606,778258,933910,265294,"Nota S.C.E. 21161/29"]
[null,null,"2017-09-14",1400864,622606,778258,933910,265294,"Nota S.C.E. 21161/30"]
[null,null,"2017-09-15",1400864,622606,778258,933910,265294,"Nota S.C.E. 21161/31"]
[null,null,"2017-09-16",1400864,622606,778258,933910,265294,"Nota S.C.E. 21161/32"]
[null,null,"2017-09-17",1400864,622606,778258,933910,265294,"Nota S.C.E. 21161/33"]
[null,null,"2017-09-18",1400864,622606,778258,933910,265294,"Nota S.C.E. 21161/34"]
[null,null,"2017-09-19",1400864,622606,778258,933910,265294,"Nota S.C.E. 21161/35"]
[null,null,"2017-09-20",1400864,622606,778258,933910,265294,"Nota S.C.E. 21161/36"]
[null,null,"2017-09-21",1400864,622606,778258,933910,265294,"Nota S.C.E. 21161/37"]
[null,null,"2017-09-22",1400864,622606,778258,933910,265294,"Nota S.C.E. 21161/38"]
[null,null,"2017-09-23",1400864,622606,778258,933910,265294,"Nota S.C.E. 21161/39"]
[null,null,"2017-09-24",1400864,622606,778258,933910,265294,"Nota S.C.E. 21161/40"]
[null,null,"2017-09-25",1400864,622606,778258,933910,265294,"Nota S.C.E. 21161/41"]
[null,null,"2017-09-26",1400864,622606,778258,933910,265294,"Nota S.C.E. 21161/42"]
[null,null,"2017-09-27",1400864,622606,778258,933910,265294,"Nota S.C.E. 21161/43"]
[null,null,"2017-09-28",1400864,622606,778258,933910,265294,"Nota S.C.E. 21161/44"]
[null,null,"2017-09-29",1400864,622606,778258,933910,265294,"Nota S.C.E. 21161/45"]
[null,null,"2017-09-30",1400864,622606,778258,933910,265294,"Nota S.C.E. 21161/46"]
[null,null,"2017-10-01",1400864,622606,778258,933910,265294,"Nota S.C.E. 21161/47"]
[null,null,"2017-10-02",1400864,622606,778258,933910,265294,"Nota S.C.E. 21161/48"]
[null,null,"2017-10-03",1400864,622606,778258,933910,265294,"Nota S.C.E. 21161/49"]
[null,null,"2017-10-04",1400864,622606,778258,933910,265294,"Nota S.C.E. 21161/50"]
[null,null,"2017-10-05",1400864,622606,778258,933910,265294,"Nota S.C.E. 21161/51"]
[null,null,"2017-10-06",1400864,622606,778258,933910,265294,"Nota S.C.E. 21161/52"]
[null,null,"2017-10-07",1400864,622606,778258,933910,265294,"Nota S.C.E. 21161/53"]
[null,null,"2017-10-08",1400864,622606,778258,933910,265294,"Nota S.C.E. 21161/54"]
[null,null,"2017-10-09",1400864,622606,778258,933910,265294,"Nota S.C.E. 21161/55"]
[null,null,"2017-10-10",1400864,622606,778258,933910,265294,"Nota S.C.E. 21161/56"]
[null,null,"2017-10-11",1400864,622606,778258,933910,265294,"Nota S.C.E. 21161/57"]
[null,null,"2017-10-12",1400864,622606,778258,933910,265294,"Nota S.C.E. 21161/58"]
[null,null,"2017-10-13",1400864,622606,778258,933910,265294,"Nota S.C.E. 21161/59"]
[null,null,"2017-10-14",1400864,622606,778258,933910,265294,"Nota S.C.E. 21161/60"]
[null,null,"2017-10-15",1400864,622606,778258,933910,265294,"Nota S.C.E. 21161/61"]
[null,null,"2017-10-16",1400864,622606,778258,933910,265294,"Nota S.C.E. 21161/62"]
[null,null,"2017-10-17",1400864,622606,778258,933910,265294,"Nota S.C.E. 21161/63"]
[null,null,"2017-10-18",1400864,622606,778258,933910,265294,"Nota S.C.E. 21161/64"]
[null,null,"2017-10-19",1400864,622606,778258,933910,265294,"Nota S.C.E. 21161/65"]
[null,null,"2017-10-20",1400864,622606,778258,933910,265294,"Nota S.C.E. 21161/66"]
[null,null,"2017-10-21",1400864,622606,778258,933910,265294,"Nota S.C.E. 21161/67"]
[null,null,"2017-10-22",1400864,622606,778258,933910,265294,"Nota S.C.E. 21161/68"]
[null,null,"2017-10-23",1400864,622606,778258,933910,265294,"Nota S.C.E. 21161/69"]
[null,null,"2017-10-24",1400864,622606,778258,933910,265294,"Nota S.C.E. 21161/70"]
[null,null,"2017-10-25",1400864,622606,778258,933910,265294,"Nota S.C.E. 21161/71"]
[null,null,"2017-10-26",1400864,622606,778258,933910,265294,"Nota S.C.E. 21161/72"]
[null,null,"2017-10-27",1400864,622606,778258,933910,265294,"Nota S.C.E. 21161/73"]
[null,null,"2017-10-28",1400864,622606,778258,933910,265294,"Nota S.C.E. 21161/74"]
[null,null,"2017-10-29",1400864,622606,778258,933910,265294,"Nota S.C.E. 21161/75"]
[null,null,"2017-10-30",1400864,622606,778258,933910,265294,"Nota S.C.E. 21161/76"]
[null,null,"2017-10-31",1400864,622606,778258,933910,265294,"Nota S.C.E. 21161/77"]
[null,null,"2017-11-01",1400864,622606,778258,933910,265294,"Nota S.C.E. 21161/78"]
[null,null,"2017-11-02",1400864,622606,778258,933910,265294,"Nota S.C.E. 21161/79"]
[null,null,"2017-11-03",1400864,622606,778258,933910,265294,"Nota S.C.E. 21161/80"]
[null,null,"2017-11-04",1400864,622606,778258,933910,265294,"Nota S.C.E. 21161/81"]
[null,null,"2017-11-05",1400864,622606,778258,933910,265294,"Nota S.C.E. 21161/82"]
[null,null,"2017-11-06",1400864,622606,778258,933910,265294,"Nota S.C.E. 21161/83"]
[null,null,"2017-11-07",1400864,622606,778258,933910,265294,"Nota S.C.E. 21161/84"]
[null,null,"2017-11-08",1400864,622606,778258,933910,265294,"Nota S.C.E. 21161/85"]
[null,null,"2017-11-09",1400864,622606,778258,933910,265294,"Nota S.C.E. 21161/86"]
[null,null,"2017-11-10",1400864,622606,778258,933910,265294,"Nota S.C.E. 21161/87"]
[null,null,"2017-11-11",1400864,622606,778258,933910,265294,"Nota S.C.E. 21161/88"]
[null,null,"2017-11-12",1400864,622606,778258,933910,265294,"Nota S.C.E. 21161/89"]
[null,null,"2017-11-13",1400864,622606,778258,933910,265294,"Nota S.C.E. 21161/90"]
[null,null,"2017-11-14",1400864,622606,778258,933910,265294,"Nota S.C.E. 21161/91"]
[null,null,"2017-11-15",1400864,622606,778258,933910,265294,"Nota S.C.E. 21161/92"]
[null,null,"2017-11-16",1400864,622606,778258,933910,265294,"Nota S.C.E. 21161/93"]
[null,null,"2017-11-17",1400864,622606,778258,933910,265294,"Nota S.C.E. 21161/94"]
[null,null,"2017-11-18",1400864,622606,778258,933910,265294,"Nota S.C.E. 21161/95"]
[null,null,"2017-11-19",1400864,622606,778258,933910,265294,"Nota S.C.E. 21161/96"]
[null,null,"2017-11-20",1400864,622606,778258,933910,265294,"Nota S.C.E. 21161/97"]
[null,null,"2017-11-21",1400864,622606,778258,933910,265294,"Nota S.C.E. 21161/98"]
[null,null,"2017-11-22",1400864,622606,778258,933910,265294,"Nota S.C.E. 21161/99"]
[null,null,"2017-11-23",1400864,622606,778258,933910,265294,"Nota S.C.E. 21161/100"]
[null,null,"2017-11-24",1400864,622606,778258,933910,265294,"Nota S.C.E. 21161/101"]
[null,null,"2017-11-25",1400864,622606,778258,933910,265294,"Nota S.C.E. 21161/102"]
[null,null,"2017-11-26",1400864,622606,778258,933910,265294,"Nota S.C.E. 21161/103"]
[null,null,"2017-11-27",1400864,622606,778258,933910,265294,"Nota S.C.E. 21161/104"]
[null,null,"2017-11-28",1400864,622606,778258,933910,265294,"Nota S.C.E. 21161/105"]
[null,null,"2017-11-29",1400864,622606,778258,933910,265294,"Nota S.C.E. 21161/106"]
[null,null,"2017-11-30",1400864,622606,778258,933910,265294,"Nota S.C.E. 21161/107"]
[null,null,"2017-12-01",1400864,622606,778258,933910,265294,"Nota S.C.E. 21161/108"]
[null,null,"2017-12-02",1400864,622606,778258,933910,265294,"Nota S.C.E. 21161/109"]
[null,null,"2017-12-03",1400864,622606,778258,933910,265294,"Nota S.C.E. 21161/110"]
[null,null,"2017-12-04",1400864,622606,778258,933910,265294,"Nota S.C.E. 21161/111"]
[null,null,"2017-12-05",1400864,622606,778258,933910,265294,"Nota S.C.E. 21161/112"]
[null,null,"2017-12-06",1400864,622606,778258,933910,265294,"Nota S.C.E. 21161/113"]
[null,null,"2017-12-07",1400864,622606,778258,933910,265294,"Nota S.C.E. 21161/114"]
[null,null,"2017-12-08",1400864,622606,778258,933910,265294,"Nota S.C.E. 21161/115"]
[null,null,"2017-12-09",1400864,622606,778258,933910,265294,"Nota S.C.E. 21161/116"]
[null,null,"2017-12-10",1400864,622606,778258,933910,265294,"Nota S.C.E. 21161/117"]
[null,null,"2017-12-11",1400864,622606,778258,933910,265294,"Nota S.C.E. 21161/118"]
[null,null,"2017-12-12",1400864,622606,778258,933910,265294,"Nota S.C.E. 21161/119"]
[null,null,"2017-12-13",1400864,622606,778258,933910,265294,"Nota S.C.E. 21161/120"]
[null,null,"2017-12-14",1400864,622606,778258,933910,265294,"Nota S.C.E. 21161/121"]
[null,null,"2017-12-15",1400864,622606,778258,933910,265294,"Nota S.C.E. 21161/122"]
[null,null,"2017-12-16",1400864,622606,778258,933910,265294,"Nota S.C.E. 21161/123"]
[null,null,"2017-12-17",1400864,622606,778258,933910,265294,"Nota S.C.E. 21161/124"]
[null,null,"2017-12-18",1400864,622606,778258,933910,265294,"Nota S.C.E. 21161/125"]
[null,null,"2017-12-19",1400864,622606,778258,933910,265294,"Nota S.C.E. 21161/126"]
[null,null,"2017-12-20",1400864,622606,778258,933910,265294,"Nota S.C.E. 21161/127"]
[null,null,"2017-12-21",1400864,622606,778258,933910,265294,"Nota S.C.E. 21161/128"]
[null,null,"2017-12-22",1400864,622606,778258,933910,265294,"Nota S.C.E. 21161/129"]
[null,null,"2017-12-23",1400864,622606,778258,933910,265294,"Nota S.C.E. 21161/130"]
[null,null,"2017-12-24",1400864,622606,778258,933910,265294,"Nota S.C.E. 21161/131"]
[null,null,"2017-12-25",1400864,622606,778258,933910,265294,"Nota S.C.E. 21161/132"]
[null,null,"2017-12-26",1400864,622606,778258,933910,265294,"Nota S.C.E. 21161/133"]
[null,null,"2017-12-27",1400864,622606,778258,933910,265294,"Nota S.C.E. 21161/134"]
[null,null,"2017-12-28",1400864,622606,778258,933910,265294,"Nota S.C.E. 21161/135"]
[null,null,"2017-12-29",1400864,622606,778258,933910,265294,"Nota S.C.E. 21161/136"]
[null,null,"2017-12-30",1400864,622606,778258,933910,265294,"Nota S.C.E. 21161/137"]
[null,null,"2017-12-31",1400864,622606,778258,933910,265294,"Nota S.C.E. 21161/138"]
[null,null,"2018-01-01",1400864,622606,778258,933910,265294,"Nota S.C.E. 21161/139"]
[null,null,"2018-01-02",1400864,622606,778258,933910,265294,"Nota S.C.E. 21161/140"]
[null,null,"2018-01-03",1400864,622606,778258,933910,265294,"Nota S.C.E. 21161/141"]
[null,null,"2018-01-04",1400864,622606,778258,933910,265294,"Nota S.C.E. 21161/142"]
[null,null,"2018-01-05",1400864,622606,778258,933910,265294,"Nota S.C.E. 21161/143"]
[null,null,"2018-01-06",1400864,622606,778258,933910,265294,"Nota S.C.E. 21161/144"]
[null,null,"2018-01-07",1400864,622606,778258,933910,265294,"Nota S.C.E. 21161/145"]
[null,null,"2018-01-08",1400864,622606,778258,933910,265294,"Nota S.C.E. 21161/146"]
[null,null,"2018-01-09",1400864,622606,778258,933910,265294,"Nota S.C.E. 21161/147"]
[null,null,"2018-01-10",1400864,622606,778258,933910,265294,"Nota S.C.E. 21161/148"]
[null,null,"2018-01-11",1400864,622606,778258,933910,265294,"Nota S.C.E. 21161/149"]
[null,null,"2018-01-12",1400864,622606,778258,933910,265294,"Nota S.C.E. 21161/150"]
[null,null,"2018-01-13",1400864,622606,778258,933910,265294,"Nota S.C.E. 21161/151"]
[null,null,"2018-01-14",1400864,622606,778258,933910,265294,"Nota S.C.E. 21161/152"]
[null,null,"2018-01-15",1400864,622606,778258,933910,265294,"Nota S.C.E. 21161/153"]
[null,null,"2018-01-16",1400864,622606,778258,933910,265294,"Nota S.C.E. 21161/154"]
[null,null,"2018-01-17",1400864,622606,778258,933910,265294,"Nota S.C.E. 21161/155"]
[null,null,"2018-01-18",1400864,622606,778258,933910,265294,"Nota S.C.E. 21161/156"]
[null,null,"2018-01-19",1400864,622606,778258,933910,265294,"Nota S.C.E. 21161/157"]
[null,null,"2018-01-20",1400864,622606,778258,933910,265294,"Nota S.C.E. 21161/158"]
[null,null,"2018-01-21",1400864,622606,778258,933910,265294,"Nota S.C.E. 21161/159"]
[null,null,"2018-01-22",1400864,622606,778258,933910,265294,"Nota S.C.E. 21161/160"]
[null,null,"2018-01-23",1400864,622606,778258,933910,265294,"Nota S.C.E. 21161/161"]
[null,null,"2018-01-24",1400864,622606,778258,933910,265294,"Nota S.C.E. 21161/162"]
[null,null,"2018-01-25",1400864,622606,778258,933910,265294,"Nota S.C.E. 21161/163"]
[null,null,"2018-01-26",1400864,622606,778258,933910,265294,"Nota S.C.E. 21161/164"]
[null,null,"2018-01-27",1400864,622606,778258,933910,265294,"Nota S.C.E. 21161/165"]
[null,null,"2018-01-28",1400864,622606,778258,933910,265294,"Nota S.C.E. 21161/166"]
[null,null,"2018-01-29",1400864,622606,778258,933910,265294,"Nota S.C.E. 21161/167"]
[null,null,"2018-01-30",1400864,622606,778258,933910,265294,"Nota S.C.E. 21161/168"]
[null,null,"2018-01-31",1400864,622606,778258,933910,265294,"Nota S.C.E. 21161/169"]
[null,null,"2018-02-01",1400864,622606,778258,933910,265294,"Nota S.C.E. 21161/170"]
[null,null,"2018-02-02",1400864,622606,778258,933910,265294,"Nota S.C.E. 21161/171"]
[null,null,"2018-02-03",1400864,622606,778258,933910,265294,"Nota S.C.E. 21161/172"]
[null,null,"2018-02-04",1400864,622606,778258,933910,265294,"Nota S.C.E. 21161/173"]
[null,null,"2018-02-05",1400864,622606,778258,933910,265294,"Nota S.C.E. 21161/174"]
[null,null,"2018-02-06",1400864,622606,778258,933910,265294,"Nota S.C.E. 21161/175"]
[null,null,"2018-02-07",1400864,622606,778258,933910,265294,"Nota S.C.E. 21161/176"]
[null,null,"2018-02-08",1400864,622606,778258,933910,265294,"Nota S.C.E. 21161/177"]
[null,null,"2018-02-09",1400864,622606,778258,933910,265294,"Nota S.C.E. 21161/178"]
[null,null,"2018-02-10",1400864,622606,778258,933910,265294,"Nota S.C.E. 21161/179"]
[null,null,"2018-02-11",1400864,622606,778258,933910,265294,"Nota S.C.E. 21161/180"]
[null,null,"2018-02-12",1400864,622606,778258,933910,265294,"Nota S.C.E. 21161/181"]
[null,null,"2018-02-13",1400864,622606,778258,933910,265294,"Nota S.C.E. 21161/182"]
[null,null,"2018-02-14",1400864,622606,778258,933910,265294,"Nota S.C.E. 21161/183"]
[null,null,"2018-02-15",1400864,622606,778258,933910,265294,"Nota S.C.E. 21161/184"]
[null,null,"2018-02-16",1400864,622606,778258,933910,265294,"Nota S.C.E. 21161/185"]
[null,null,"2018-02-17",1400864,622606,778258,933910,265294,"Nota S.C.E. 21161/186"]
[null,null,"2018-02-18",1400864,622606,778258,933910,265294,"Nota S.C.E. 21161/187"]
[null,null,"2018-02-19",1400864,622606,778258,933910,265294,"Nota S.C.E. 21161/188"]
[null,null,"2018-02-20",1400864,622606,778258,933910,265294,"Nota S.C.E. 21161/189"]
[null,null,"2018-02-21",1400864,622606,778258,933910,265294,"Nota S.C.E. 21161/190"]
[null,null,"2018-02-22",1400864,622606,778258,933910,265294,"Nota S.C.E. 21161/191"]
[null,null,"2018-02-23",1400864,622606,778258,933910,265294,"Nota S.C.E. 21161/192"]
[null,null,"2018-02-24",1400864,622606,778258,933910,265294,"Nota S.C.E. 21161/193"]
[null,null,"2018-02-25",1400864,622606,778258,933910,265294,"Nota S.C.E. 21161/194"]
[null,null,"2018-02-26",1400864,622606,778258,933910,265294,"Nota S.C.E. 21161/195"]
[null,null,"2018-02-27",1400864,622606,778258,933910,265294,"Nota S.C.E. 21161/196"]
[null,null,"2018-02-28",1400864,622606,778258,933910,265294,"Nota S.C.E. 21161/197"]
[null,null,"2018-03-01",1569865,697718,872147,1046577,297299,"Nota S.C.E. 6026/18"]
[null,null,"2018-03-02",1569865,697718,872147,1046577,297299,"Nota S.C.E. 6026/18"]
[null,null,"2018-03-03",1569865,697718,872147,1046577,297299,"Nota S.C.E. 6026/18"]
[null,null,"2018-03-04",1569865,697718,872147,1046577,297299,"Nota S.C.E. 6026/18"]
[null,null,"2018-03-05",1569865,697718,872147,1046577,297299,"Nota S.C.E. 6026/18"]
[null,null,"2018-03-06",1569865,697718,872147,1046577,297299,"Nota S.C.E. 6026/18"]
[null,null,"2018-03-07",1569865,697718,872147,1046577,297299,"Nota S.C.E. 6026/18"]
[null,null,"2018-03-08",1569865,697718,872147,1046577,297299,"Nota S.C.E. 6026/18"]
[null,null,"2018-03-09",1569865,697718,872147,1046577,297299,"Nota S.C.E. 6026/18"]
[null,null,"2018-03-10",1569865,697718,872147,1046577,297299,"Nota S.C.E. 6026/18"]
[null,null,"2018-03-11",1569865,697718,872147,1046577,297299,"Nota S.C.E. 6026/18"]
[null,null,"2018-03-12",1569865,697718,872147,1046577,297299,"Nota S.C.E. 6026/18"]
[null,null,"2018-03-13",1569865,697718,872147,1046577,297299,"Nota S.C.E. 6026/18"]
[null,null,"2018-03-14",1569865,697718,872147,1046577,297299,"Nota S.C.E. 6026/18"]
[null,null,"2018-03-15",1569865,697718,872147,1046577,297299,"Nota S.C.E. 6026/18"]
[null,null,"2018-03-16",1569865,697718,872147,1046577,297299,"Nota S.C.E. 6026/18"]
[null,null,"2018-03-17",1569865,697718,872147,1046577,297299,"Nota S.C.E. 6026/18"]
[null,null,"2018-03-18",1569865,697718,872147,1046577,297299,"Nota S.C.E. 6026/18"]
[null,null,"2018-03-19",1569865,697718,872147,1046577,297299,"Nota S.C.E. 6026/18"]
[null,null,"2018-03-20",1569865,697718,872147,1046577,297299,"Nota S.C.E. 6026/18"]
[null,null,"2018-03-21",1569865,697718,872147,1046577,297299,"Nota S.C.E. 6026/18"]
[null,null,"2018-03-22",1569865,697718,872147,1046577,297299,"Nota S.C.E. 6026/18"]
[null,null,"2018-03-23",1569865,697718,872147,1046577,297299,"Nota S.C.E. 6026/18"]
[null,null,"2018-03-24",1569865,697718,872147,1046577,297299,"Nota S.C.E. 6026/18"]
[null,null,"2018-03-25",1569865,697718,872147,1046577,297299,"Nota S.C.E. 6026/18"]
[null,null,"2018-03-26",1569865,697718,872147,1046577,297299,"Nota S.C.E. 6026/18"]
[null,null,"2018-03-27",1569865,697718,872147,1046577,297299,"Nota S.C.E. 6026/18"]
[null,null,"2018-03-28",1569865,697718,872147,1046577,297299,"Nota S.C.E. 6026/18"]
[null,null,"2018-03-29",1569865,697718,872147,1046577,297299,"Nota S.C.E. 6026/18"]
[null,null,"2018-03-30",1569865,697718,872147,1046577,297299,"Nota S.C.E. 6026/18"]
[null,null,"2018-03-31",1569865,697718,872147,1046577,297299,"Nota S.C.E. 6026/18"]
[null,null,"2018-04-01",1569865,697718,872147,1046577,297299,"Nota S.C.E. 6026/18"]
[null,null,"2018-04-02",1569865,697718,872147,1046577,297299,"Nota S.C.E. 6026/18"]
[null,null,"2018-04-03",1569865,697718,872147,1046577,297299,"Nota S.C.E. 6026/18"]
[null,null,"2018-04-04",1569865,697718,872147,1046577,297299,"Nota S.C.E. 6026/18"]
[null,null,"2018-04-05",1569865,697718,872147,1046577,297299,"Nota S.C.E. 6026/18"]
[null,null,"2018-04-06",1569865,697718,872147,1046577,297299,"Nota S.C.E. 6026/18"]
[null,null,"2018-04-07",1569865,697718,872147,1046577,297299,"Nota S.C.E. 6026/18"]
[null,null,"2018-04-08",1569865,697718,872147,1046577,297299,"Nota S.C.E. 6026/18"]
[null,null,"2018-04-09",1569865,697718,872147,1046577,297299,"Nota S.C.E. 6026/18"]
[null,null,"2018-04-10",1569865,697718,872147,1046577,297299,"Nota S.C.E. 6026/18"]
[null,null,"2018-04-11",1569865,697718,872147,1046577,297299,"Nota S.C.E. 6026/18"]
[null,null,"2018-04-12",1569865,697718,872147,1046577,297299,"Nota S.C.E. 6026/18"]
[null,null,"2018-04-13",1569865,697718,872147,1046577,297299,"Nota S.C.E. 6026/18"]
[null,null,"2018-04-14",1569865,697718,872147,1046577,297299,"Nota S.C.E. 6026/18"]
[null,null,"2018-04-15",1569865,697718,872147,1046577,297299,"Nota S.C.E. 6026/18"]
[null,null,"2018-04-16",1569865,697718,872147,1046577,297299,"Nota S.C.E. 6026/18"]
[null,null,"2018-04-17",1569865,697718,872147,1046577,297299,"Nota S.C.E. 6026/18"]
[null,null,"2018-04-18",1569865,697718,872147,1046577,297299,"Nota S.C.E. 6026/18"]
[null,null,"2018-04-19",1569865,697718,872147,1046577,297299,"Nota S.C.E. 6026/18"]
[null,null,"2018-04-20",1569865,697718,872147,1046577,297299,"Nota S.C.E. 6026/18"]
[null,null,"2018-04-21",1569865,697718,872147,1046577,297299,"Nota S.C.E. 6026/18"]
[null,null,"2018-04-22",1569865,697718,872147,1046577,297299,"Nota S.C.E. 6026/18"]
[null,null,"2018-04-23",1569865,697718,872147,1046577,297299,"Nota S.C.E. 6026/18"]
[null,null,"2018-04-24",1569865,697718,872147,1046577,297299,"Nota S.C.E. 6026/18"]
[null,null,"2018-04-25",1569865,697718,872147,1046577,297299,"Nota S.C.E. 6026/18"]
[null,null,"2018-04-26",1569865,697718,872147,1046577,297299,"Nota S.C.E. 6026/18"]
[null,null,"2018-04-27",1569865,697718,872147,1046577,297299,"Nota S.C.E. 6026/18"]
[null,null,"2018-04-28",1569865,697718,872147,1046577,297299,"Nota S.C.E. 6026/18"]
[null,null,"2018-04-29",1569865,697718,872147,1046577,297299,"Nota S.C.E. 6026/18"]
[null,null,"2018-04-30",1569865,697718,872147,1046577,297299,"Nota S.C.E. 6026/18"]
[null,null,"2018-05-01",1569865,697718,872147,1046577,297299,"Nota S.C.E. 6026/18"]
[null,null,"2018-05-02",1569865,697718,872147,1046577,297299,"Nota S.C.E. 6026/18"]
[null,null,"2018-05-03",1569865,697718,872147,1046577,297299,"Nota S.C.E. 6026/18"]
[null,null,"2018-05-04",1569865,697718,872147,1046577,297299,"Nota S.C.E. 6026/18"]
[null,null,"2018-05-05",1569865,697718,872147,1046577,297299,"Nota S.C.E. 6026/18"]
[null,null,"2018-05-06",1569865,697718,872147,1046577,297299,"Nota S.C.E. 6026/18"]
[null,null,"2018-05-07",1569865,697718,872147,1046577,297299,"Nota S.C.E. 6026/18"]
[null,null,"2018-05-08",1569865,697718,872147,1046577,297299,"Nota S.C.E. 6026/18"]
[null,null,"2018-05-09",1569865,697718,872147,1046577,297299,"Nota S.C.E. 6026/18"]
[null,null,"2018-05-10",1569865,697718,872147,1046577,297299,"Nota S.C.E. 6026/18"]
[null,null,"2018-05-11",1569865,697718,872147,1046577,297299,"Nota S.C.E. 6026/18"]
[null,null,"2018-05-12",1569865,697718,872147,1046577,297299,"Nota S.C.E. 6026/18"]
[null,null,"2018-05-13",1569865,697718,872147,1046577,297299,"Nota S.C.E. 6026/18"]
[null,null,"2018-05-14",1569865,697718,872147,1046577,297299,"Nota S.C.E. 6026/18"]
[null,null,"2018-05-15",1569865,697718,872147,1046577,297299,"Nota S.C.E. 6026/18"]
[null,null,"2018-05-16",1569865,697718,872147,1046577,297299,"Nota S.C.E. 6026/18"]
[null,null,"2018-05-17",1569865,697718,872147,1046577,297299,"Nota S.C.E. 6026/18"]
[null,null,"2018-05-18",1569865,697718,872147,1046577,297299,"Nota S.C.E. 6026/18"]
[null,null,"2018-05-19",1569865,697718,872147,1046577,297299,"Nota S.C.E. 6026/18"]
[null,null,"2018-05-20",1569865,697718,872147,1046577,297299,"Nota S.C.E. 6026/18"]
[null,null,"2018-05-21",1569865,697718,872147,1046577,297299,"Nota S.C.E. 6026/18"]
[null,null,"2018-05-22",1569865,697718,872147,1046577,297299,"Nota S.C.E. 6026/18"]
[null,null,"2018-05-23",1569865,697718,872147,1046577,297299,"Nota S.C.E. 6026/18"]
[null,null,"2018-05-24",1569865,697718,872147,1046577,297299,"Nota S.C.E. 6026/18"]
[null,null,"2018-05-25",1569865,697718,872147,1046577,297299,"Nota S.C.E. 6026/18"]
[null,null,"2018-05-26",1569865,697718,872147,1046577,297299,"Nota S.C.E. 6026/18"]
[null,null,"2018-05-27",1569865,697718,872147,1046577,297299,"Nota S.C.E. 6026/18"]
[null,null,"2018-05-28",1569865,697718,872147,1046577,297299,"Nota S.C.E. 6026/18"]
[null,null,"2018-05-29",1569865,697718,872147,1046577,297299,"Nota S.C.E. 6026/18"]
[null,null,"2018-05-30",1569865,697718,872147,1046577,297299,"Nota S.C.E. 6026/18"]
[null,null,"2018-05-31",1569865,697718,872147,1046577,297299,"Nota S.C.E. 6026/18"]
[null,null,"2018-06-01",1569865,697718,872147,1046577,297299,"Nota S.C.E. 6026/18"]
[null,null,"2018-06-02",1569865,697718,872147,1046577,297299,"Nota S.C.E. 6026/18"]
[null,null,"2018-06-03",1569865,697718,872147,1046577,297299,"Nota S.C.E. 6026/18"]
[null,null,"2018-06-04",1569865,697718,872147,1046577,297299,"Nota S.C.E. 6026/18"]
[null,null,"2018-06-05",1569865,697718,872147,1046577,297299,"Nota S.C.E. 6026/18"]
[null,null,"2018-06-06",1569865,697718,872147,1046577,297299,"Nota S.C.E. 6026/18"]
[null,null,"2018-06-07",1569865,697718,872147,1046577,297299,"Nota S.C.E. 6026/18"]
[null,null,"2018-06-08",1569865,697718,872147,1046577,297299,"Nota S.C.E. 6026/18"]
[null,null,"2018-06-09",1569865,697718,872147,1046577,297299,"Nota S.C.E. 6026/18"]
[null,null,"2018-06-10",1569865,697718,872147,1046577,297299,"Nota S.C.E. 6026/18"]
[null,null,"2018-06-11",1569865,697718,872147,1046577,297299,"Nota S.C.E. 6026/18"]
[null,null,"2018-06-12",1569865,697718,872147,1046577,297299,"Nota S.C.E. 6026/18"]
[null,null,"2018-06-13",1569865,697718,872147,1046577,297299,"Nota S.C.E. 6026/18"]
[null,null,"2018-06-14",1569865,697718,872147,1046577,297299,"Nota S.C.E. 6026/18"]
[null,null,"2018-06-15",1569865,697718,872147,1046577,297299,"Nota S.C.E. 6026/18"]
[null,null,"2018-06-16",1569865,697718,872147,1046577,297299,"Nota S.C.E. 6026/18"]
[null,null,"2018-06-17",1569865,697718,872147,1046577,297299,"Nota S.C.E. 6026/18"]
[null,null,"2018-06-18",1569865,697718,872147,1046577,297299,"Nota S.C.E. 6026/18"]
[null,null,"2018-06-19",1569865,697718,872147,1046577,297299,"Nota S.C.E. 6026/18"]
[null,null,"2018-06-20",1569865,697718,872147,1046577,297299,"Nota S.C.E. 6026/18"]
[null,null,"2018-06-21",1569865,697718,872147,1046577,297299,"Nota S.C.E. 6026/18"]
[null,null,"2018-06-22",1569865,697718,872147,1046577,297299,"Nota S.C.E. 6026/18"]
[null,null,"2018-06-23",1569865,697718,872147,1046577,297299,"Nota S.C.E. 6026/18"]
[null,null,"2018-06-24",1569865,697718,872147,1046577,297299,"Nota S.C.E. 6026/18"]
[null,null,"2018-06-25",1569865,697718,872147,1046577,297299,"Nota S.C.E. 6026/18"]
[null,null,"2018-06-26",1569865,697718,872147,1046577,297299,"Nota S.C.E. 6026/18"]
[null,null,"2018-06-27",1569865,697718,872147,1046577,297299,"Nota S.C.E. 6026/18"]
[null,null,"2018-06-28",1569865,697718,872147,1046577,297299,"Nota S.C.E. 6026/18"]
[null,null,"2018-06-29",1569865,697718,872147,1046577,297299,"Nota S.C.E. 6026/18"]
[null,null,"2018-06-30",1569865,697718,872147,1046577,297299,"Nota S.C.E. 6026/18"]
[null,null,"2018-07-01",1569865,697718,872147,1046577,297299,"Nota S.C.E. 6026/18"]
[null,null,"2018-07-02",1569865,697718,872147,1046577,297299,"Nota S.C.E. 6026/18"]
[null,null,"2018-07-03",1569865,697718,872147,1046577,297299,"Nota S.C.E. 6026/18"]
[null,null,"2018-07-04",1569865,697718,872147,1046577,297299,"Nota S.C.E. 6026/18"]
[null,null,"2018-07-05",1569865,697718,872147,1046577,297299,"Nota S.C.E. 6026/18"]
[null,null,"2018-07-06",1569865,697718,872147,1046577,297299,"Nota S.C.E. 6026/18"]
[null,null,"2018-07-07",1569865,697718,872147,1046577,297299,"Nota S.C.E. 6026/18"]
[null,null,"2018-07-08",1569865,697718,872147,1046577,297299,"Nota S.C.E. 6026/18"]
[null,null,"2018-07-09",1569865,697718,872147,1046577,297299,"Nota S.C.E. 6026/18"]
[null,null,"2018-07-10",1569865,697718,872147,1046577,297299,"Nota S.C.E. 6026/18"]
[null,null,"2018-07-11",1569865,697718,872147,1046577,297299,"Nota S.C.E. 6026/18"]
[null,null,"2018-07-12",1569865,697718,872147,1046577,297299,"Nota S.C.E. 6026/18"]
[null,null,"2018-07-13",1569865,697718,872147,1046577,297299,"Nota S.C.E. 6026/18"]
[null,null,"2018-07-14",1569865,697718,872147,1046577,297299,"Nota S.C.E. 6026/18"]
[null,null,"2018-07-15",1569865,697718,872147,1046577,297299,"Nota S.C.E. 6026/18"]
[null,null,"2018-07-16",1569865,697718,872147,1046577,297299,"Nota S.C.E. 6026/18"]
[null,null,"2018-07-17",1569865,697718,872147,1046577,297299,"Nota S.C.E. 6026/18"]
[null,null,"2018-07-18",1569865,697718,872147,1046577,297299,"Nota S.C.E. 6026/18"]
[null,null,"2018-07-19",1569865,697718,872147,1046577,297299,"Nota S.C.E. 6026/18"]
[null,null,"2018-07-20",1569865,697718,872147,1046577,297299,"Nota S.C.E. 6026/18"]
[null,null,"2018-07-21",1569865,697718,872147,1046577,297299,"Nota S.C.E. 6026/18"]
[null,null,"2018-07-22",1569865,697718,872147,1046577,297299,"Nota S.C.E. 6026/18"]
[null,null,"2018-07-23",1569865,697718,872147,1046577,297299,"Nota S.C.E. 6026/18"]
[null,null,"2018-07-24",1569865,697718,872147,1046577,297299,"Nota S.C.E. 6026/18"]
[null,null,"2018-07-25",1569865,697718,872147,1046577,297299,"Nota S.C.E. 6026/18"]
[null,null,"2018-07-26",1569865,697718,872147,1046577,297299,"Nota S.C.E. 6026/18"]
[null,null,"2018-07-27",1569865,697718,872147,1046577,297299,"Nota S.C.E. 6026/18"]
[null,null,"2018-07-28",1569865,697718,872147,1046577,297299,"Nota S.C.E. 6026/18"]
[null,null,"2018-07-29",1569865,697718,872147,1046577,297299,"Nota S.C.E. 6026/18"]
[null,null,"2018-07-30",1569865,697718,872147,1046577,297299,"Nota S.C.E. 6026/18"]
[null,null,"2018-07-31",1569865,697718,872147,1046577,297299,"Nota S.C.E. 6026/18"]
[null,null,"2018-08-01",1569865,697718,872147,1046577,297299,"Nota S.C.E. 6026/18"]
[null,null,"2018-08-02",1569865,697718,872147,1046577,297299,"Nota S.C.E. 6026/18"]
[null,null,"2018-08-03",1569865,697718,872147,1046577,297299,"Nota S.C.E. 6026/18"]
[null,null,"2018-08-04",1569865,697718,872147,1046577,297299,"Nota S.C.E. 6026/18"]
[null,null,"2018-08-05",1569865,697718,872147,1046577,297299,"Nota S.C.E. 6026/18"]
[null,null,"2018-08-06",1569865,697718,872147,1046577,297299,"Nota S.C.E. 6026/18"]
[null,null,"2018-08-07",1569865,697718,872147,1046577,297299,"Nota S.C.E. 6026/18"]
[null,null,"2018-08-08",1569865,697718,872147,1046577,297299,"Nota S.C.E. 6026/18"]
[null,null,"2018-08-09",1569865,697718,872147,1046577,297299,"Nota S.C.E. 6026/18"]
[null,null,"2018-08-10",1569865,697718,872147,1046577,297299,"Nota S.C.E. 6026/18"]
[null,null,"2018-08-11",1569865,697718,872147,1046577,297299,"Nota S.C.E. 6026/18"]
[null,null,"2018-08-12",1569865,697718,872147,1046577,297299,"Nota S.C.E. 6026/18"]
[null,null,"2018-08-13",1569865,697718,872147,1046577,297299,"Nota S.C.E. 6026/18"]
[null,null,"2018-08-14",1569865,697718,872147,1046577,297299,"Nota S.C.E. 6026/18"]
[null,null,"2018-08-15",1569865,697718,872147,1046577,297299,"Nota S.C.E. 6026/18"]
[null,null,"2018-08-16",1569865,697718,872147,1046577,297299,"Nota S.C.E. 6026/18"]
[null,null,"2018-08-17",1569865,697718,872147,1046577,297299,"Nota S.C.E. 6026/18"]
[null,null,"2018-08-18",1569865,697718,872147,1046577,297299,"Nota S.C.E. 6026/18"]
[null,null,"2018-08-19",1569865,697718,872147,1046577,297299,"Nota S.C.E. 6026/18"]
[null,null,"2018-08-20",1569865,697718,872147,1046577,297299,"Nota S.C.E. 6026/18"]
[null,null,"2018-08-21",1569865,697718,872147,1046577,297299,"Nota S.C.E. 6026/18"]
[null,null,"2018-08-22",1569865,697718,872147,1046577,297299,"Nota S.C.E. 6026/18"]
[null,null,"2018-08-23",1569865,697718,872147,1046577,297299,"Nota S.C.E. 6026/18"]
[null,null,"2018-08-24",1569865,697718,872147,1046577,297299,"Nota S.C.E. 6026/18"]
[null,null,"2018-08-25",1569865,697718,872147,1046577,297299,"Nota S.C.E. 6026/18"]
[null,null,"2018-08-26",1569865,697718,872147,1046577,297299,"Nota S.C.E. 6026/18"]
[null,null,"2018-08-27",1569865,697718,872147,1046577,297299,"Nota S.C.E. 6026/18"]
[null,null,"2018-08-28",1569865,697718,872147,1046577,297299,"Nota S.C.E. 6026/18"]
[null,null,"2018-08-29",1569865,697718,872147,1046577,297299,"Nota S.C.E. 6026/18"]
[null,null,"2018-08-30",1569865,697718,872147,1046577,297299,"Nota S.C.E. 6026/18"]
[null,null,"2018-08-31",1569865,697718,872147,1046577,297299,"Nota S.C.E. 6026/18"]
[null,null,"2018-09-01",1766636,785172,981465,1177758,334563,"Nota G.C.P. 18437/18"]
[null,null,"2018-09-02",1766636,785172,981465,1177758,334563,"Nota G.C.P. 18437/18"]
[null,null,"2018-09-03",1766636,785172,981465,1177758,334563,"Nota G.C.P. 18437/18"]
[null,null,"2018-09-04",1766636,785172,981465,1177758,334563,"Nota G.C.P. 18437/18"]
[null,null,"2018-09-05",1766636,785172,981465,1177758,334563,"Nota G.C.P. 18437/18"]
[null,null,"2018-09-06",1766636,785172,981465,1177758,334563,"Nota G.C.P. 18437/18"]
[null,null,"2018-09-07",1766636,785172,981465,1177758,334563,"Nota G.C.P. 18437/18"]
[null,null,"2018-09-08",1766636,785172,981465,1177758,334563,"Nota G.C.P. 18437/18"]
[null,null,"2018-09-09",1766636,785172,981465,1177758,334563,"Nota G.C.P. 18437/18"]
[null,null,"2018-09-10",1766636,785172,981465,1177758,334563,"Nota G.C.P. 18437/18"]
[null,null,"2018-09-11",1766636,785172,981465,1177758,334563,"Nota G.C.P. 18437/18"]
[null,null,"2018-09-12",1766636,785172,981465,1177758,334563,"Nota G.C.P. 18437/18"]
[null,null,"2018-09-13",1766636,785172,981465,1177758,334563,"Nota G.C.P. 18437/18"]
[null,null,"2018-09-14",1766636,785172,981465,1177758,334563,"Nota G.C.P. 18437/18"]
[null,null,"2018-09-15",1766636,785172,981465,1177758,334563,"Nota G.C.P. 18437/18"]
[null,null,"2018-09-16",1766636,785172,981465,1177758,334563,"Nota G.C.P. 18437/18"]
[null,null,"2018-09-17",1766636,785172,981465,1177758,334563,"Nota G.C.P. 18437/18"]
[null,null,"2018-09-18",1766636,785172,981465,1177758,334563,"Nota G.C.P. 18437/18"]
[null,null,"2018-09-19",1766636,785172,981465,1177758,334563,"Nota G.C.P. 18437/18"]
[null,null,"2018-09-20",1766636,785172,981465,1177758,334563,"Nota G.C.P. 18437/18"]
[null,null,"2018-09-21",1766636,785172,981465,1177758,334563,"Nota G.C.P. 18437/18"]
[null,null,"2018-09-22",1766636,785172,981465,1177758,334563,"Nota G.C.P. 18437/18"]
[null,null,"2018-09-23",1766636,785172,981465,1177758,334563,"Nota G.C.P. 18437/18"]
[null,null,"2018-09-24",1766636,785172,981465,1177758,334563,"Nota G.C.P. 18437/18"]
[null,null,"2018-09-25",1766636,785172,981465,1177758,334563,"Nota G.C.P. 18437/18"]
[null,null,"2018-09-26",1766636,785172,981465,1177758,334563,"Nota G.C.P. 18437/18"]
[null,null,"2018-09-27",1766636,785172,981465,1177758,334563,"Nota G.C.P. 18437/18"]
[null,null,"2018-09-28",1766636,785172,981465,1177758,334563,"Nota G.C.P. 18437/18"]
[null,null,"2018-09-29",1766636,785172,981465,1177758,334563,"Nota G.C.P. 18437/18"]
[null,null,"2018-09-30",1766636,785172,981465,1177758,334563,"Nota G.C.P. 18437/18"]
[null,null,"2018-10-01",1766636,785172,981465,1177758,334563,"Nota G.C.P. 18437/18"]
[null,null,"2018-10-02",1766636,785172,981465,1177758,334563,"Nota G.C.P. 18437/18"]
[null,null,"2018-10-03",1766636,785172,981465,1177758,334563,"Nota G.C.P. 18437/18"]
[null,null,"2018-10-04",1766636,785172,981465,1177758,334563,"Nota G.C.P. 18437/18"]
[null,null,"2018-10-05",1766636,785172,981465,1177758,334563,"Nota G.C.P. 18437/18"]
[null,null,"2018-10-06",1766636,785172,981465,1177758,334563,"Nota G.C.P. 18437/18"]
[null,null,"2018-10-07",1766636,785172,981465,1177758,334563,"Nota G.C.P. 18437/18"]
[null,null,"2018-10-08",1766636,785172,981465,1177758,334563,"Nota G.C.P. 18437/18"]
[null,null,"2018-10-09",1766636,785172,981465,1177758,334563,"Nota G.C.P. 18437/18"]
[null,null,"2018-10-10",1766636,785172,981465,1177758,334563,"Nota G.C.P. 18437/18"]
[null,null,"2018-10-11",1766636,785172,981465,1177758,334563,"Nota G.C.P. 18437/18"]
[null,null,"2018-10-12",1766636,785172,981465,1177758,334563,"Nota G.C.P. 18437/18"]
[null,null,"2018-10-13",1766636,785172,981465,1177758,334563,"Nota G.C.P. 18437/18"]
[null,null,"2018-10-14",1766636,785172,981465,1177758,334563,"Nota G.C.P. 18437/18"]
[null,null,"2018-10-15",1766636,785172,981465,1177758,334563,"Nota G.C.P. 18437/18"]
[null,null,"2018-10-16",1766636,785172,981465,1177758,334563,"Nota G.C.P. 18437/18"]
[null,null,"2018-10-17",1766636,785172,981465,1177758,334563,"Nota G.C.P. 18437/18"]
[null,null,"2018-10-18",1766636,785172,981465,1177758,334563,"Nota G.C.P. 18437/18"]
[null,null,"2018-10-19",1766636,785172,981465,1177758,334563,"Nota G.C.P. 18437/18"]
[null,null,"2018-10-20",1766636,785172,981465,1177758,334563,"Nota G.C.P. 18437/18"]
[null,null,"2018-10-21",1766636,785172,981465,1177758,334563,"Nota G.C.P. 18437/18"]
[null,null,"2018-10-22",1766636,785172,981465,1177758,334563,"Nota G.C.P. 18437/18"]
[null,null,"2018-10-23",1766636,785172,981465,1177758,334563,"Nota G.C.P. 18437/18"]
[null,null,"2018-10-24",1766636,785172,981465,1177758,334563,"Nota G.C.P. 18437/18"]
[null,null,"2018-10-25",1766636,785172,981465,1177758,334563,"Nota G.C.P. 18437/18"]
[null,null,"2018-10-26",1766636,785172,981465,1177758,334563,"Nota G.C.P. 18437/18"]
[null,null,"2018-10-27",1766636,785172,981465,1177758,334563,"Nota G.C.P. 18437/18"]
[null,null,"2018-10-28",1766636,785172,981465,1177758,334563,"Nota G.C.P. 18437/18"]
[null,null,"2018-10-29",1766636,785172,981465,1177758,334563,"Nota G.C.P. 18437/18"]
[null,null,"2018-10-30",1766636,785172,981465,1177758,334563,"Nota G.C.P. 18437/18"]
[null,null,"2018-10-31",1766636,785172,981465,1177758,334563,"Nota G.C.P. 18437/18"]
[null,null,"2018-11-01",1766636,785172,981465,1177758,334563,"Nota G.C.P. 18437/18"]
[null,null,"2018-11-02",1766636,785172,981465,1177758,334563,"Nota G.C.P. 18437/18"]
[null,null,"2018-11-03",1766636,785172,981465,1177758,334563,"Nota G.C.P. 18437/18"]
[null,null,"2018-11-04",1766636,785172,981465,1177758,334563,"Nota G.C.P. 18437/18"]
[null,null,"2018-11-05",1766636,785172,981465,1177758,334563,"Nota G.C.P. 18437/18"]
[null,null,"2018-11-06",1766636,785172,981465,1177758,334563,"Nota G.C.P. 18437/18"]
[null,null,"2018-11-07",1766636,785172,981465,1177758,334563,"Nota G.C.P. 18437/18"]
[null,null,"2018-11-08",1766636,785172,981465,1177758,334563,"Nota G.C.P. 18437/18"]
[null,null,"2018-11-09",1766636,785172,981465,1177758,334563,"Nota G.C.P. 18437/18"]
[null,null,"2018-11-10",1766636,785172,981465,1177758,334563,"Nota G.C.P. 18437/18"]
[null,null,"2018-11-11",1766636,785172,981465,1177758,334563,"Nota G.C.P. 18437/18"]
[null,null,"2018-11-12",1766636,785172,981465,1177758,334563,"Nota G.C.P. 18437/18"]
[null,null,"2018-11-13",1766636,785172,981465,1177758,334563,"Nota G.C.P. 18437/18"]
[null,null,"2018-11-14",1766636,785172,981465,1177758,334563,"Nota G.C.P. 18437/18"]
[null,null,"2018-11-15",1766636,785172,981465,1177758,334563,"Nota G.C.P. 18437/18"]
[null,null,"2018-11-16",1766636,785172,981465,1177758,334563,"Nota G.C.P. 18437/18"]
[null,null,"2018-11-17",1766636,785172,981465,1177758,334563,"Nota G.C.P. 18437/18"]
[null,null,"2018-11-18",1766636,785172,981465,1177758,334563,"Nota G.C.P. 18437/18"]
[null,null,"2018-11-19",1766636,785172,981465,1177758,334563,"Nota G.C.P. 18437/18"]
[null,null,"2018-11-20",1766636,785172,981465,1177758,334563,"Nota G.C.P. 18437/18"]
[null,null,"2018-11-21",1766636,785172,981465,1177758,334563,"Nota G.C.P. 18437/18"]
[null,null,"2018-11-22",1766636,785172,981465,1177758,334563,"Nota G.C.P. 18437/18"]
[null,null,"2018-11-23",1766636,785172,981465,1177758,334563,"Nota G.C.P. 18437/18"]
[null,null,"2018-11-24",1766636,785172,981465,1177758,334563,"Nota G.C.P. 18437/18"]
[null,null,"2018-11-25",1766636,785172,981465,1177758,334563,"Nota G.C.P. 18437/18"]
[null,null,"2018-11-26",1766636,785172,981465,1177758,334563,"Nota G.C.P. 18437/18"]
[null,null,"2018-11-27",1766636,785172,981465,1177758,334563,"Nota G.C.P. 18437/18"]
[null,null,"2018-11-28",1766636,785172,981465,1177758,334563,"Nota G.C.P. 18437/18"]
[null,null,"2018-11-29",1766636,785172,981465,1177758,334563,"Nota G.C.P. 18437/18"]
[null,null,"2018-11-30",1766636,785172,981465,1177758,334563,"Nota G.C.P. 18437/18"]
[null,null,"2018-12-01",1766636,785172,981465,1177758,334563,"Nota G.C.P. 18437/18"]
[null,null,"2018-12-02",1766636,785172,981465,1177758,334563,"Nota G.C.P. 18437/18"]
[null,null,"2018-12-03",1766636,785172,981465,1177758,334563,"Nota G.C.P. 18437/18"]
[null,null,"2018-12-04",1766636,785172,981465,1177758,334563,"Nota G.C.P. 18437/18"]
[null,null,"2018-12-05",1766636,785172,981465,1177758,334563,"Nota G.C.P. 18437/18"]
[null,null,"2018-12-06",1766636,785172,981465,1177758,334563,"Nota G.C.P. 18437/18"]
[null,null,"2018-12-07",1766636,785172,981465,1177758,334563,"Nota G.C.P. 18437/18"]
[null,null,"2018-12-08",1766636,785172,981465,1177758,334563,"Nota G.C.P. 18437/18"]
[null,null,"2018-12-09",1766636,785172,981465,1177758,334563,"Nota G.C.P. 18437/18"]
[null,null,"2018-12-10",1766636,785172,981465,1177758,334563,"Nota G.C.P. 18437/18"]
[null,null,"2018-12-11",1766636,785172,981465,1177758,334563,"Nota G.C.P. 18437/18"]
[null,null,"2018-12-12",1766636,785172,981465,1177758,334563,"Nota G.C.P. 18437/18"]
[null,null,"2018-12-13",1766636,785172,981465,1177758,334563,"Nota G.C.P. 18437/18"]
[null,null,"2018-12-14",1766636,785172,981465,1177758,334563,"Nota G.C.P. 18437/18"]
[null,null,"2018-12-15",1766636,785172,981465,1177758,334563,"Nota G.C.P. 18437/18"]
[null,null,"2018-12-16",1766636,785172,981465,1177758,334563,"Nota G.C.P. 18437/18"]
[null,null,"2018-12-17",1766636,785172,981465,1177758,334563,"Nota G.C.P. 18437/18"]
[null,null,"2018-12-18",1766636,785172,981465,1177758,334563,"Nota G.C.P. 18437/18"]
[null,null,"2018-12-19",1766636,785172,981465,1177758,334563,"Nota G.C.P. 18437/18"]
[null,null,"2018-12-20",1766636,785172,981465,1177758,334563,"Nota G.C.P. 18437/18"]
[null,null,"2018-12-21",1766636,785172,981465,1177758,334563,"Nota G.C.P. 18437/18"]
[null,null,"2018-12-22",1766636,785172,981465,1177758,334563,"Nota G.C.P. 18437/18"]
[null,null,"2018-12-23",1766636,785172,981465,1177758,334563,"Nota G.C.P. 18437/18"]
[null,null,"2018-12-24",1766636,785172,981465,1177758,334563,"Nota G.C.P. 18437/18"]
[null,null,"2018-12-25",1766636,785172,981465,1177758,334563,"Nota G.C.P. 18437/18"]
[null,null,"2018-12-26",1766636,785172,981465,1177758,334563,"Nota G.C.P. 18437/18"]
[null,null,"2018-12-27",1766636,785172,981465,1177758,334563,"Nota G.C.P. 18437/18"]
[null,null,"2018-12-28",1766636,785172,981465,1177758,334563,"Nota G.C.P. 18437/18"]
[null,null,"2018-12-29",1766636,785172,981465,1177758,334563,"Nota G.C.P. 18437/18"]
[null,null,"2018-12-30",1766636,785172,981465,1177758,334563,"Nota G.C.P. 18437/18"]
[null,null,"2018-12-31",1766636,785172,981465,1177758,334563,"Nota G.C.P. 18437/18"]
[null,null,"2019-01-01",1766636,785172,981465,1177758,334563,"Nota G.C.P. 18437/18"]
[null,null,"2019-01-02",1766636,785172,981465,1177758,334563,"Nota G.C.P. 18437/18"]
[null,null,"2019-01-03",1766636,785172,981465,1177758,334563,"Nota G.C.P. 18437/18"]
[null,null,"2019-01-04",1766636,785172,981465,1177758,334563,"Nota G.C.P. 18437/18"]
[null,null,"2019-01-05",1766636,785172,981465,1177758,334563,"Nota G.C.P. 18437/18"]
[null,null,"2019-01-06",1766636,785172,981465,1177758,334563,"Nota G.C.P. 18437/18"]
[null,null,"2019-01-07",1766636,785172,981465,1177758,334563,"Nota G.C.P. 18437/18"]
[null,null,"2019-01-08",1766636,785172,981465,1177758,334563,"Nota G.C.P. 18437/18"]
[null,null,"2019-01-09",1766636,785172,981465,1177758,334563,"Nota G.C.P. 18437/18"]
[null,null,"2019-01-10",1766636,785172,981465,1177758,334563,"Nota G.C.P. 18437/18"]
[null,null,"2019-01-11",1766636,785172,981465,1177758,334563,"Nota G.C.P. 18437/18"]
[null,null,"2019-01-12",1766636,785172,981465,1177758,334563,"Nota G.C.P. 18437/18"]
[null,null,"2019-01-13",1766636,785172,981465,1177758,334563,"Nota G.C.P. 18437/18"]
[null,null,"2019-01-14",1766636,785172,981465,1177758,334563,"Nota G.C.P. 18437/18"]
[null,null,"2019-01-15",1766636,785172,981465,1177758,334563,"Nota G.C.P. 18437/18"]
[null,null,"2019-01-16",1766636,785172,981465,1177758,334563,"Nota G.C.P. 18437/18"]
[null,null,"2019-01-17",1766636,785172,981465,1177758,334563,"Nota G.C.P. 18437/18"]
[null,null,"2019-01-18",1766636,785172,981465,1177758,334563,"Nota G.C.P. 18437/18"]
[null,null,"2019-01-19",1766636,785172,981465,1177758,334563,"Nota G.C.P. 18437/18"]
[null,null,"2019-01-20",1766636,785172,981465,1177758,334563,"Nota G.C.P. 18437/18"]
[null,null,"2019-01-21",1766636,785172,981465,1177758,334563,"Nota G.C.P. 18437/18"]
[null,null,"2019-01-22",1766636,785172,981465,1177758,334563,"Nota G.C.P. 18437/18"]
[null,null,"2019-01-23",1766636,785172,981465,1177758,334563,"Nota G.C.P. 18437/18"]
[null,null,"2019-01-24",1766636,785172,981465,1177758,334563,"Nota G.C.P. 18437/18"]
[null,null,"2019-01-25",1766636,785172,981465,1177758,334563,"Nota G.C.P. 18437/18"]
[null,null,"2019-01-26",1766636,785172,981465,1177758,334563,"Nota G.C.P. 18437/18"]
[null,null,"2019-01-27",1766636,785172,981465,1177758,334563,"Nota G.C.P. 18437/18"]
[null,null,"2019-01-28",1766636,785172,981465,1177758,334563,"Nota G.C.P. 18437/18"]
[null,null,"2019-01-29",1766636,785172,981465,1177758,334563,"Nota G.C.P. 18437/18"]
[null,null,"2019-01-30",1766636,785172,981465,1177758,334563,"Nota G.C.P. 18437/18"]
[null,null,"2019-01-31",1766636,785172,981465,1177758,334563,"Nota G.C.P. 18437/18"]
[null,null,"2019-02-01",1766636,785172,981465,1177758,334563,"Nota G.C.P. 18437/18"]
[null,null,"2019-02-02",1766636,785172,981465,1177758,334563,"Nota G.C.P. 18437/18"]
[null,null,"2019-02-03",1766636,785172,981465,1177758,334563,"Nota G.C.P. 18437/18"]
[null,null,"2019-02-04",1766636,785172,981465,1177758,334563,"Nota G.C.P. 18437/18"]
[null,null,"2019-02-05",1766636,785172,981465,1177758,334563,"Nota G.C.P. 18437/18"]
[null,null,"2019-02-06",1766636,785172,981465,1177758,334563,"Nota G.C.P. 18437/18"]
[null,null,"2019-02-07",1766636,785172,981465,1177758,334563,"Nota G.C.P. 18437/18"]
[null,null,"2019-02-08",1766636,785172,981465,1177758,334563,"Nota G.C.P. 18437/18"]
[null,null,"2019-02-09",1766636,785172,981465,1177758,334563,"Nota G.C.P. 18437/18"]
[null,null,"2019-02-10",1766636,785172,981465,1177758,334563,"Nota G.C.P. 18437/18"]
[null,null,"2019-02-11",1766636,785172,981465,1177758,334563,"Nota G.C.P. 18437/18"]
[null,null,"2019-02-12",1766636,785172,981465,1177758,334563,"Nota G.C.P. 18437/18"]
[null,null,"2019-02-13",1766636,785172,981465,1177758,334563,"Nota G.C.P. 18437/18"]
[null,null,"2019-02-14",1766636,785172,981465,1177758,334563,"Nota G.C.P. 18437/18"]
[null,null,"2019-02-15",1766636,785172,981465,1177758,334563,"Nota G.C.P. 18437/18"]
[null,null,"2019-02-16",1766636,785172,981465,1177758,334563,"Nota G.C.P. 18437/18"]
[null,null,"2019-02-17",1766636,785172,981465,1177758,334563,"Nota G.C.P. 18437/18"]
[null,null,"2019-02-18",1766636,785172,981465,1177758,334563,"Nota G.C.P. 18437/18"]
[null,null,"2019-02-19",1766636,785172,981465,1177758,334563,"Nota G.C.P. 18437/18"]
[null,null,"2019-02-20",1766636,785172,981465,1177758,334563,"Nota G.C.P. 18437/18"]
[null,null,"2019-02-21",1766636,785172,981465,1177758,334563,"Nota G.C.P. 18437/18"]
[null,null,"2019-02-22",1766636,785172,981465,1177758,334563,"Nota G.C.P. 18437/18"]
[null,null,"2019-02-23",1766636,785172,981465,1177758,334563,"Nota G.C.P. 18437/18"]
[null,null,"2019-02-24",1766636,785172,981465,1177758,334563,"Nota G.C.P. 18437/18"]
[null,null,"2019-02-25",1766636,785172,981465,1177758,334563,"Nota G.C.P. 18437/18"]
[null,null,"2019-02-26",1766636,785172,981465,1177758,334563,"Nota G.C.P. 18437/18"]
[null,null,"2019-02-27",1766636,785172,981465,1177758,334563,"Nota G.C.P. 18437/18"]
[null,null,"2019-02-28",1766636,785172,981465,1177758,334563,"Nota G.C.P. 18437/18"]
[null,null,"2019-03-01",2049647,910954,1138693,1366431,388159,"Nota G.C.P. 2727/19"]
[null,null,"2019-03-02",2049647,910954,1138693,1366431,388159,"Nota G.C.P. 2727/19"]
[null,null,"2019-03-03",2049647,910954,1138693,1366431,388159,"Nota G.C.P. 2727/19"]
[null,null,"2019-03-04",2049647,910954,1138693,1366431,388159,"Nota G.C.P. 2727/19"]
[null,null,"2019-03-05",2049647,910954,1138693,1366431,388159,"Nota G.C.P. 2727/19"]
[null,null,"2019-03-06",2049647,910954,1138693,1366431,388159,"Nota G.C.P. 2727/19"]
[null,null,"2019-03-07",2049647,910954,1138693,1366431,388159,"Nota G.C.P. 2727/19"]
[null,null,"2019-03-08",2049647,910954,1138693,1366431,388159,"Nota G.C.P. 2727/19"]
[null,null,"2019-03-09",2049647,910954,1138693,1366431,388159,"Nota G.C.P. 2727/19"]
[null,null,"2019-03-10",2049647,910954,1138693,1366431,388159,"Nota G.C.P. 2727/19"]
[null,null,"2019-03-11",2049647,910954,1138693,1366431,388159,"Nota G.C.P. 2727/19"]
[null,null,"2019-03-12",2049647,910954,1138693,1366431,388159,"Nota G.C.P. 2727/19"]
[null,null,"2019-03-13",2049647,910954,1138693,1366431,388159,"Nota G.C.P. 2727/19"]
[null,null,"2019-03-14",2049647,910954,1138693,1366431,388159,"Nota G.C.P. 2727/19"]
[null,null,"2019-03-15",2049647,910954,1138693,1366431,388159,"Nota G.C.P. 2727/19"]
[null,null,"2019-03-16",2049647,910954,1138693,1366431,388159,"Nota G.C.P. 2727/19"]
[null,null,"2019-03-17",2049647,910954,1138693,1366431,388159,"Nota G.C.P. 2727/19"]
[null,null,"2019-03-18",2049647,910954,1138693,1366431,388159,"Nota G.C.P. 2727/19"]
[null,null,"2019-03-19",2049647,910954,1138693,1366431,388159,"Nota G.C.P. 2727/19"]
[null,null,"2019-03-20",2049647,910954,1138693,1366431,388159,"Nota G.C.P. 2727/19"]
[null,null,"2019-03-21",2049647,910954,1138693,1366431,388159,"Nota G.C.P. 2727/19"]
[null,null,"2019-03-22",2049647,910954,1138693,1366431,388159,"Nota G.C.P. 2727/19"]
[null,null,"2019-03-23",2049647,910954,1138693,1366431,388159,"Nota G.C.P. 2727/19"]
[null,null,"2019-03-24",2049647,910954,1138693,1366431,388159,"Nota G.C.P. 2727/19"]
[null,null,"2019-03-25",2049647,910954,1138693,1366431,388159,"Nota G.C.P. 2727/19"]
[null,null,"2019-03-26",2049647,910954,1138693,1366431,388159,"Nota G.C.P. 2727/19"]
[null,null,"2019-03-27",2049647,910954,1138693,1366431,388159,"Nota G.C.P. 2727/19"]
[null,null,"2019-03-28",2049647,910954,1138693,1366431,388159,"Nota G.C.P. 2727/19"]
[null,null,"2019-03-29",2049647,910954,1138693,1366431,388159,"Nota G.C.P. 2727/19"]
[null,null,"2019-03-30",2049647,910954,1138693,1366431,388159,"Nota G.C.P. 2727/19"]
[null,null,"2019-03-31",2049647,910954,1138693,1366431,388159,"Nota G.C.P. 2727/19"]
[null,null,"2019-04-01",2049647,910954,1138693,1366431,388159,"Nota G.C.P. 2727/19"]
[null,null,"2019-04-02",2049647,910954,1138693,1366431,388159,"Nota G.C.P. 2727/19"]
[null,null,"2019-04-03",2049647,910954,1138693,1366431,388159,"Nota G.C.P. 2727/19"]
[null,null,"2019-04-04",2049647,910954,1138693,1366431,388159,"Nota G.C.P. 2727/19"]
[null,null,"2019-04-05",2049647,910954,1138693,1366431,388159,"Nota G.C.P. 2727/19"]
[null,null,"2019-04-06",2049647,910954,1138693,1366431,388159,"Nota G.C.P. 2727/19"]
[null,null,"2019-04-07",2049647,910954,1138693,1366431,388159,"Nota G.C.P. 2727/19"]
[null,null,"2019-04-08",2049647,910954,1138693,1366431,388159,"Nota G.C.P. 2727/19"]
[null,null,"2019-04-09",2049647,910954,1138693,1366431,388159,"Nota G.C.P. 2727/19"]
[null,null,"2019-04-10",2049647,910954,1138693,1366431,388159,"Nota G.C.P. 2727/19"]
[null,null,"2019-04-11",2049647,910954,1138693,1366431,388159,"Nota G.C.P. 2727/19"]
[null,null,"2019-04-12",2049647,910954,1138693,1366431,388159,"Nota G.C.P. 2727/19"]
[null,null,"2019-04-13",2049647,910954,1138693,1366431,388159,"Nota G.C.P. 2727/19"]
[null,null,"2019-04-14",2049647,910954,1138693,1366431,388159,"Nota G.C.P. 2727/19"]
[null,null,"2019-04-15",2049647,910954,1138693,1366431,388159,"Nota G.C.P. 2727/19"]
[null,null,"2019-04-16",2049647,910954,1138693,1366431,388159,"Nota G.C.P. 2727/19"]
[null,null,"2019-04-17",2049647,910954,1138693,1366431,388159,"Nota G.C.P. 2727/19"]
[null,null,"2019-04-18",2049647,910954,1138693,1366431,388159,"Nota G.C.P. 2727/19"]
[null,null,"2019-04-19",2049647,910954,1138693,1366431,388159,"Nota G.C.P. 2727/19"]
[null,null,"2019-04-20",2049647,910954,1138693,1366431,388159,"Nota G.C.P. 2727/19"]
[null,null,"2019-04-21",2049647,910954,1138693,1366431,388159,"Nota G.C.P. 2727/19"]
[null,null,"2019-04-22",2049647,910954,1138693,1366431,388159,"Nota G.C.P. 2727/19"]
[null,null,"2019-04-23",2049647,910954,1138693,1366431,388159,"Nota G.C.P. 2727/19"]
[null,null,"2019-04-24",2049647,910954,1138693,1366431,388159,"Nota G.C.P. 2727/19"]
[null,null,"2019-04-25",2049647,910954,1138693,1366431,388159,"Nota G.C.P. 2727/19"]
[null,null,"2019-04-26",2049647,910954,1138693,1366431,388159,"Nota G.C.P. 2727/19"]
[null,null,"2019-04-27",2049647,910954,1138693,1366431,388159,"Nota G.C.P. 2727/19"]
[null,null,"2019-04-28",2049647,910954,1138693,1366431,388159,"Nota G.C.P. 2727/19"]
[null,null,"2019-04-29",2049647,910954,1138693,1366431,388159,"Nota G.C.P. 2727/19"]
[null,null,"2019-04-30",2049647,910954,1138693,1366431,388159,"Nota G.C.P. 2727/19"]
[null,null,"2019-05-01",2049647,910954,1138693,1366431,388159,"Nota G.C.P. 2727/19"]
[null,null,"2019-05-02",2049647,910954,1138693,1366431,388159,"Nota G.C.P. 2727/19"]
[null,null,"2019-05-03",2049647,910954,1138693,1366431,388159,"Nota G.C.P. 2727/19"]
[null,null,"2019-05-04",2049647,910954,1138693,1366431,388159,"Nota G.C.P. 2727/19"]
[null,null,"2019-05-05",2049647,910954,1138693,1366431,388159,"Nota G.C.P. 2727/19"]
[null,null,"2019-05-06",2049647,910954,1138693,1366431,388159,"Nota G.C.P. 2727/19"]
[null,null,"2019-05-07",2049647,910954,1138693,1366431,388159,"Nota G.C.P. 2727/19"]
[null,null,"2019-05-08",2049647,910954,1138693,1366431,388159,"Nota G.C.P. 2727/19"]
[null,null,"2019-05-09",2049647,910954,1138693,1366431,388159,"Nota G.C.P. 2727/19"]
[null,null,"2019-05-10",2049647,910954,1138693,1366431,388159,"Nota G.C.P. 2727/19"]
[null,null,"2019-05-11",2049647,910954,1138693,1366431,388159,"Nota G.C.P. 2727/19"]
[null,null,"2019-05-12",2049647,910954,1138693,1366431,388159,"Nota G.C.P. 2727/19"]
[null,null,"2019-05-13",2049647,910954,1138693,1366431,388159,"Nota G.C.P. 2727/19"]
[null,null,"2019-05-14",2049647,910954,1138693,1366431,388159,"Nota G.C.P. 2727/19"]
[null,null,"2019-05-15",2049647,910954,1138693,1366431,388159,"Nota G.C.P. 2727/19"]
[null,null,"2019-05-16",2049647,910954,1138693,1366431,388159,"Nota G.C.P. 2727/19"]
[null,null,"2019-05-17",2049647,910954,1138693,1366431,388159,"Nota G.C.P. 2727/19"]
[null,null,"2019-05-18",2049647,910954,1138693,1366431,388159,"Nota G.C.P. 2727/19"]
[null,null,"2019-05-19",2049647,910954,1138693,1366431,388159,"Nota G.C.P. 2727/19"]
[null,null,"2019-05-20",2049647,910954,1138693,1366431,388159,"Nota G.C.P. 2727/19"]
[null,null,"2019-05-21",2049647,910954,1138693,1366431,388159,"Nota G.C.P. 2727/19"]
[null,null,"2019-05-22",2049647,910954,1138693,1366431,388159,"Nota G.C.P. 2727/19"]
[null,null,"2019-05-23",2049647,910954,1138693,1366431,388159,"Nota G.C.P. 2727/19"]
[null,null,"2019-05-24",2049647,910954,1138693,1366431,388159,"Nota G.C.P. 2727/19"]
[null,null,"2019-05-25",2049647,910954,1138693,1366431,388159,"Nota G.C.P. 2727/19"]
[null,null,"2019-05-26",2049647,910954,1138693,1366431,388159,"Nota G.C.P. 2727/19"]
[null,null,"2019-05-27",2049647,910954,1138693,1366431,388159,"Nota G.C.P. 2727/19"]
[null,null,"2019-05-28",2049647,910954,1138693,1366431,388159,"Nota G.C.P. 2727/19"]
[null,null,"2019-05-29",2049647,910954,1138693,1366431,388159,"Nota G.C.P. 2727/19"]
[null,null,"2019-05-30",2049647,910954,1138693,1366431,388159,"Nota G.C.P. 2727/19"]
[null,null,"2019-05-31",2049647,910954,1138693,1366431,388159,"Nota G.C.P. 2727/19"]
[null,null,"2019-06-01",2049647,910954,1138693,1366431,388159,"Nota G.C.P. 2727/19"]
[null,null,"2019-06-02",2049647,910954,1138693,1366431,388159,"Nota G.C.P. 2727/19"]
[null,null,"2019-06-03",2049647,910954,1138693,1366431,388159,"Nota G.C.P. 2727/19"]
[null,null,"2019-06-04",2049647,910954,1138693,1366431,388159,"Nota G.C.P. 2727/19"]
[null,null,"2019-06-05",2049647,910954,1138693,1366431,388159,"Nota G.C.P. 2727/19"]
[null,null,"2019-06-06",2049647,910954,1138693,1366431,388159,"Nota G.C.P. 2727/19"]
[null,null,"2019-06-07",2049647,910954,1138693,1366431,388159,"Nota G.C.P. 2727/19"]
[null,null,"2019-06-08",2049647,910954,1138693,1366431,388159,"Nota G.C.P. 2727/19"]
[null,null,"2019-06-09",2049647,910954,1138693,1366431,388159,"Nota G.C.P. 2727/19"]
[null,null,"2019-06-10",2049647,910954,1138693,1366431,388159,"Nota G.C.P. 2727/19"]
[null,null,"2019-06-11",2049647,910954,1138693,1366431,388159,"Nota G.C.P. 2727/19"]
[null,null,"2019-06-12",2049647,910954,1138693,1366431,388159,"Nota G.C.P. 2727/19"]
[null,null,"2019-06-13",2049647,910954,1138693,1366431,388159,"Nota G.C.P. 2727/19"]
[null,null,"2019-06-14",2049647,910954,1138693,1366431,388159,"Nota G.C.P. 2727/19"]
[null,null,"2019-06-15",2049647,910954,1138693,1366431,388159,"Nota G.C.P. 2727/19"]
[null,null,"2019-06-16",2049647,910954,1138693,1366431,388159,"Nota G.C.P. 2727/19"]
[null,null,"2019-06-17",2049647,910954,1138693,1366431,388159,"Nota G.C.P. 2727/19"]
[null,null,"2019-06-18",2049647,910954,1138693,1366431,388159,"Nota G.C.P. 2727/19"]
[null,null,"2019-06-19",2049647,910954,1138693,1366431,388159,"Nota G.C.P. 2727/19"]
[null,null,"2019-06-20",2049647,910954,1138693,1366431,388159,"Nota G.C.P. 2727/19"]
[null,null,"2019-06-21",2049647,910954,1138693,1366431,388159,"Nota G.C.P. 2727/19"]
[null,null,"2019-06-22",2049647,910954,1138693,1366431,388159,"Nota G.C.P. 2727/19"]
[null,null,"2019-06-23",2049647,910954,1138693,1366431,388159,"Nota G.C.P. 2727/19"]
[null,null,"2019-06-24",2049647,910954,1138693,1366431,388159,"Nota G.C.P. 2727/19"]
[null,null,"2019-06-25",2049647,910954,1138693,1366431,388159,"Nota G.C.P. 2727/19"]
[null,null,"2019-06-26",2049647,910954,1138693,1366431,388159,"Nota G.C.P. 2727/19"]
[null,null,"2019-06-27",2049647,910954,1138693,1366431,388159,"Nota G.C.P. 2727/19"]
[null,null,"2019-06-28",2049647,910954,1138693,1366431,388159,"Nota G.C.P. 2727/19"]
[null,null,"2019-06-29",2049647,910954,1138693,1366431,388159,"Nota G.C.P. 2727/19"]
[null,null,"2019-06-30",2049647,910954,1138693,1366431,388159,"Nota G.C.P. 2727/19"]
[null,null,"2019-07-01",2049647,910954,1138693,1366431,388159,"Nota G.C.P. 2727/19"]
[null,null,"2019-07-02",2049647,910954,1138693,1366431,388159,"Nota G.C.P. 2727/19"]
[null,null,"2019-07-03",2049647,910954,1138693,1366431,388159,"Nota G.C.P. 2727/19"]
[null,null,"2019-07-04",2049647,910954,1138693,1366431,388159,"Nota G.C.P. 2727/19"]
[null,null,"2019-07-05",2049647,910954,1138693,1366431,388159,"Nota G.C.P. 2727/19"]
[null,null,"2019-07-06",2049647,910954,1138693,1366431,388159,"Nota G.C.P. 2727/19"]
[null,null,"2019-07-07",2049647,910954,1138693,1366431,388159,"Nota G.C.P. 2727/19"]
[null,null,"2019-07-08",2049647,910954,1138693,1366431,388159,"Nota G.C.P. 2727/19"]
[null,null,"2019-07-09",2049647,910954,1138693,1366431,388159,"Nota G.C.P. 2727/19"]
[null,null,"2019-07-10",2049647,910954,1138693,1366431,388159,"Nota G.C.P. 2727/19"]
[null,null,"2019-07-11",2049647,910954,1138693,1366431,388159,"Nota G.C.P. 2727/19"]
[null,null,"2019-07-12",2049647,910954,1138693,1366431,388159,"Nota G.C.P. 2727/19"]
[null,null,"2019-07-13",2049647,910954,1138693,1366431,388159,"Nota G.C.P. 2727/19"]
[null,null,"2019-07-14",2049647,910954,1138693,1366431,388159,"Nota G.C.P. 2727/19"]
[null,null,"2019-07-15",2049647,910954,1138693,1366431,388159,"Nota G.C.P. 2727/19"]
[null,null,"2019-07-16",2049647,910954,1138693,1366431,388159,"Nota G.C.P. 2727/19"]
[null,null,"2019-07-17",2049647,910954,1138693,1366431,388159,"Nota G.C.P. 2727/19"]
[null,null,"2019-07-18",2049647,910954,1138693,1366431,388159,"Nota G.C.P. 2727/19"]
[null,null,"2019-07-19",2049647,910954,1138693,1366431,388159,"Nota G.C.P. 2727/19"]
[null,null,"2019-07-20",2049647,910954,1138693,1366431,388159,"Nota G.C.P. 2727/19"]
[null,null,"2019-07-21",2049647,910954,1138693,1366431,388159,"Nota G.C.P. 2727/19"]
[null,null,"2019-07-22",2049647,910954,1138693,1366431,388159,"Nota G.C.P. 2727/19"]
[null,null,"2019-07-23",2049647,910954,1138693,1366431,388159,"Nota G.C.P. 2727/19"]
[null,null,"2019-07-24",2049647,910954,1138693,1366431,388159,"Nota G.C.P. 2727/19"]
[null,null,"2019-07-25",2049647,910954,1138693,1366431,388159,"Nota G.C.P. 2727/19"]
[null,null,"2019-07-26",2049647,910954,1138693,1366431,388159,"Nota G.C.P. 2727/19"]
[null,null,"2019-07-27",2049647,910954,1138693,1366431,388159,"Nota G.C.P. 2727/19"]
[null,null,"2019-07-28",2049647,910954,1138693,1366431,388159,"Nota G.C.P. 2727/19"]
[null,null,"2019-07-29",2049647,910954,1138693,1366431,388159,"Nota G.C.P. 2727/19"]
[null,null,"2019-07-30",2049647,910954,1138693,1366431,388159,"Nota G.C.P. 2727/19"]
[null,null,"2019-07-31",2049647,910954,1138693,1366431,388159,"Nota G.C.P. 2727/19"]
[null,null,"2019-08-01",2049647,910954,1138693,1366431,388159,"Nota G.C.P. 2727/19"]
[null,null,"2019-08-02",2049647,910954,1138693,1366431,388159,"Nota G.C.P. 2727/19"]
[null,null,"2019-08-03",2049647,910954,1138693,1366431,388159,"Nota G.C.P. 2727/19"]
[null,null,"2019-08-04",2049647,910954,1138693,1366431,388159,"Nota G.C.P. 2727/19"]
[null,null,"2019-08-05",2049647,910954,1138693,1366431,388159,"Nota G.C.P. 2727/19"]
[null,null,"2019-08-06",2049647,910954,1138693,1366431,388159,"Nota G.C.P. 2727/19"]
[null,null,"2019-08-07",2049647,910954,1138693,1366431,388159,"Nota G.C.P. 2727/19"]
[null,null,"2019-08-08",2049647,910954,1138693,1366431,388159,"Nota G.C.P. 2727/19"]
[null,null,"2019-08-09",2049647,910954,1138693,1366431,388159,"Nota G.C.P. 2727/19"]
[null,null,"2019-08-10",2049647,910954,1138693,1366431,388159,"Nota G.C.P. 2727/19"]
[null,null,"2019-08-11",2049647,910954,1138693,1366431,388159,"Nota G.C.P. 2727/19"]
[null,null,"2019-08-12",2049647,910954,1138693,1366431,388159,"Nota G.C.P. 2727/19"]
[null,null,"2019-08-13",2049647,910954,1138693,1366431,388159,"Nota G.C.P. 2727/19"]
[null,null,"2019-08-14",2049647,910954,1138693,1366431,388159,"Nota G.C.P. 2727/19"]
[null,null,"2019-08-15",2049647,910954,1138693,1366431,388159,"Nota G.C.P. 2727/19"]
[null,null,"2019-08-16",2049647,910954,1138693,1366431,388159,"Nota G.C.P. 2727/19"]
[null,null,"2019-08-17",2049647,910954,1138693,1366431,388159,"Nota G.C.P. 2727/19"]
[null,null,"2019-08-18",2049647,910954,1138693,1366431,388159,"Nota G.C.P. 2727/19"]
[null,null,"2019-08-19",2049647,910954,1138693,1366431,388159,"Nota G.C.P. 2727/19"]
[null,null,"2019-08-20",2049647,910954,1138693,1366431,388159,"Nota G.C.P. 2727/19"]
[null,null,"2019-08-21",2049647,910954,1138693,1366431,388159,"Nota G.C.P. 2727/19"]
[null,null,"2019-08-22",2049647,910954,1138693,1366431,388159,"Nota G.C.P. 2727/19"]
[null,null,"2019-08-23",2049647,910954,1138693,1366431,388159,"Nota G.C.P. 2727/19"]
[null,null,"2019-08-24",2049647,910954,1138693,1366431,388159,"Nota G.C.P. 2727/19"]
[null,null,"2019-08-25",2049647,910954,1138693,1366431,388159,"Nota G.C.P. 2727/19"]
[null,null,"2019-08-26",2049647,910954,1138693,1366431,388159,"Nota G.C.P. 2727/19"]
[null,null,"2019-08-27",2049647,910954,1138693,1366431,388159,"Nota G.C.P. 2727/19"]
[null,null,"2019-08-28",2049647,910954,1138693,1366431,388159,"Nota G.C.P. 2727/19"]
[null,null,"2019-08-29",2049647,910954,1138693,1366431,388159,"Nota G.C.P. 2727/19"]
[null,null,"2019-08-30",2049647,910954,1138693,1366431,388159,"Nota G.C.P. 2727/19"]
[null,null,"2019-08-31",2049647,910954,1138693,1366431,388159,"Nota G.C.P. 2727/19"]
[null,null,"2019-09-01",2482061,1103138,1378923,1654707,470049,"Nota S.C.E. 76715123/19"]
[null,null,"2019-09-02",2482061,1103138,1378923,1654707,470049,"Nota S.C.E. 76715123/19"]
[null,null,"2019-09-03",2482061,1103138,1378923,1654707,470049,"Nota S.C.E. 76715123/19"]
[null,null,"2019-09-04",2482061,1103138,1378923,1654707,470049,"Nota S.C.E. 76715123/19"]
[null,null,"2019-09-05",2482061,1103138,1378923,1654707,470049,"Nota S.C.E. 76715123/19"]
[null,null,"2019-09-06",2482061,1103138,1378923,1654707,470049,"Nota S.C.E. 76715123/19"]
[null,null,"2019-09-07",2482061,1103138,1378923,1654707,470049,"Nota S.C.E. 76715123/19"]
[null,null,"2019-09-08",2482061,1103138,1378923,1654707,470049,"Nota S.C.E. 76715123/19"]
[null,null,"2019-09-09",2482061,1103138,1378923,1654707,470049,"Nota S.C.E. 76715123/19"]
[null,null,"2019-09-10",2482061,1103138,1378923,1654707,470049,"Nota S.C.E. 76715123/19"]
[null,null,"2019-09-11",2482061,1103138,1378923,1654707,470049,"Nota S.C.E. 76715123/19"]
[null,null,"2019-09-12",2482061,1103138,1378923,1654707,470049,"Nota S.C.E. 76715123/19"]
[null,null,"2019-09-13",2482061,1103138,1378923,1654707,470049,"Nota S.C.E. 76715123/19"]
[null,null,"2019-09-14",2482061,1103138,1378923,1654707,470049,"Nota S.C.E. 76715123/19"]
[null,null,"2019-09-15",2482061,1103138,1378923,1654707,470049,"Nota S.C.E. 76715123/19"]
[null,null,"2019-09-16",2482061,1103138,1378923,1654707,470049,"Nota S.C.E. 76715123/19"]
[null,null,"2019-09-17",2482061,1103138,1378923,1654707,470049,"Nota S.C.E. 76715123/19"]
[null,null,"2019-09-18",2482061,1103138,1378923,1654707,470049,"Nota S.C.E. 76715123/19"]
[null,null,"2019-09-19",2482061,1103138,1378923,1654707,470049,"Nota S.C.E. 76715123/19"]
[null,null,"2019-09-20",2482061,1103138,1378923,1654707,470049,"Nota S.C.E. 76715123/19"]
[null,null,"2019-09-21",2482061,1103138,1378923,1654707,470049,"Nota S.C.E. 76715123/19"]
[null,null,"2019-09-22",2482061,1103138,1378923,1654707,470049,"Nota S.C.E. 76715123/19"]
[null,null,"2019-09-23",2482061,1103138,1378923,1654707,470049,"Nota S.C.E. 76715123/19"]
[null,null,"2019-09-24",2482061,1103138,1378923,1654707,470049,"Nota S.C.E. 76715123/19"]
[null,null,"2019-09-25",2482061,1103138,1378923,1654707,470049,"Nota S.C.E. 76715123/19"]
[null,null,"2019-09-26",2482061,1103138,1378923,1654707,470049,"Nota S.C.E. 76715123/19"]
[null,null,"2019-09-27",2482061,1103138,1378923,1654707,470049,"Nota S.C.E. 76715123/19"]
[null,null,"2019-09-28",2482061,1103138,1378923,1654707,470049,"Nota S.C.E. 76715123/19"]
[null,null,"2019-09-29",2482061,1103138,1378923,1654707,470049,"Nota S.C.E. 76715123/19"]
[null,null,"2019-09-30",2482061,1103138,1378923,1654707,470049,"Nota S.C.E. 76715123/19"]
[null,null,"2019-10-01",2482061,1103138,1378923,1654707,470049,"Nota S.C.E. 76715123/19"]
[null,null,"2019-10-02",2482061,1103138,1378923,1654707,470049,"Nota S.C.E. 76715123/19"]
[null,null,"2019-10-03",2482061,1103138,1378923,1654707,470049,"Nota S.C.E. 76715123/19"]
[null,null,"2019-10-04",2482061,1103138,1378923,1654707,470049,"Nota S.C.E. 76715123/19"]
[null,null,"2019-10-05",2482061,1103138,1378923,1654707,470049,"Nota S.C.E. 76715123/19"]
[null,null,"2019-10-06",2482061,1103138,1378923,1654707,470049,"Nota S.C.E. 76715123/19"]
[null,null,"2019-10-07",2482061,1103138,1378923,1654707,470049,"Nota S.C.E. 76715123/19"]
[null,null,"2019-10-08",2482061,1103138,1378923,1654707,470049,"Nota S.C.E. 76715123/19"]
[null,null,"2019-10-09",2482061,1103138,1378923,1654707,470049,"Nota S.C.E. 76715123/19"]
[null,null,"2019-10-10",2482061,1103138,1378923,1654707,470049,"Nota S.C.E. 76715123/19"]
[null,null,"2019-10-11",2482061,1103138,1378923,1654707,470049,"Nota S.C.E. 76715123/19"]
[null,null,"2019-10-12",2482061,1103138,1378923,1654707,470049,"Nota S.C.E. 76715123/19"]
[null,null,"2019-10-13",2482061,1103138,1378923,1654707,470049,"Nota S.C.E. 76715123/19"]
[null,null,"2019-10-14",2482061,1103138,1378923,1654707,470049,"Nota S.C.E. 76715123/19"]
[null,null,"2019-10-15",2482061,1103138,1378923,1654707,470049,"Nota S.C.E. 76715123/19"]
[null,null,"2019-10-16",2482061,1103138,1378923,1654707,470049,"Nota S.C.E. 76715123/19"]
[null,null,"2019-10-17",2482061,1103138,1378923,1654707,470049,"Nota S.C.E. 76715123/19"]
[null,null,"2019-10-18",2482061,1103138,1378923,1654707,470049,"Nota S.C.E. 76715123/19"]
[null,null,"2019-10-19",2482061,1103138,1378923,1654707,470049,"Nota S.C.E. 76715123/19"]
[null,null,"2019-10-20",2482061,1103138,1378923,1654707,470049,"Nota S.C.E. 76715123/19"]
[null,null,"2019-10-21",2482061,1103138,1378923,1654707,470049,"Nota S.C.E. 76715123/19"]
[null,null,"2019-10-22",2482061,1103138,1378923,1654707,470049,"Nota S.C.E. 76715123/19"]
[null,null,"2019-10-23",2482061,1103138,1378923,1654707,470049,"Nota S.C.E. 76715123/19"]
[null,null,"2019-10-24",2482061,1103138,1378923,1654707,470049,"Nota S.C.E. 76715123/19"]
[null,null,"2019-10-25",2482061,1103138,1378923,1654707,470049,"Nota S.C.E. 76715123/19"]
[null,null,"2019-10-26",2482061,1103138,1378923,1654707,470049,"Nota S.C.E. 76715123/19"]
[null,null,"2019-10-27",2482061,1103138,1378923,1654707,470049,"Nota S.C.E. 76715123/19"]
[null,null,"2019-10-28",2482061,1103138,1378923,1654707,470049,"Nota S.C.E. 76715123/19"]
[null,null,"2019-10-29",2482061,1103138,1378923,1654707,470049,"Nota S.C.E. 76715123/19"]
[null,null,"2019-10-30",2482061,1103138,1378923,1654707,470049,"Nota S.C.E. 76715123/19"]
[null,null,"2019-10-31",2482061,1103138,1378923,1654707,470049,"Nota S.C.E. 76715123/19"]
[null,null,"2019-11-01",2482061,1103138,1378923,1654707,470049,"Nota S.C.E. 76715123/19"]
[null,null,"2019-11-02",2482061,1103138,1378923,1654707,470049,"Nota S.C.E. 76715123/19"]
[null,null,"2019-11-03",2482061,1103138,1378923,1654707,470049,"Nota S.C.E. 76715123/19"]
[null,null,"2019-11-04",2482061,1103138,1378923,1654707,470049,"Nota S.C.E. 76715123/19"]
[null,null,"2019-11-05",2482061,1103138,1378923,1654707,470049,"Nota S.C.E. 76715123/19"]
[null,null,"2019-11-06",2482061,1103138,1378923,1654707,470049,"Nota S.C.E. 76715123/19"]
[null,null,"2019-11-07",2482061,1103138,1378923,1654707,470049,"Nota S.C.E. 76715123/19"]
[null,null,"2019-11-08",2482061,1103138,1378923,1654707,470049,"Nota S.C.E. 76715123/19"]
[null,null,"2019-11-09",2482061,1103138,1378923,1654707,470049,"Nota S.C.E. 76715123/19"]
[null,null,"2019-11-10",2482061,1103138,1378923,1654707,470049,"Nota S.C.E. 76715123/19"]
[null,null,"2019-11-11",2482061,1103138,1378923,1654707,470049,"Nota S.C.E. 76715123/19"]
[null,null,"2019-11-12",2482061,1103138,1378923,1654707,470049,"Nota S.C.E. 76715123/19"]
[null,null,"2019-11-13",2482061,1103138,1378923,1654707,470049,"Nota S.C.E. 76715123/19"]
[null,null,"2019-11-14",2482061,1103138,1378923,1654707,470049,"Nota S.C.E. 76715123/19"]
[null,null,"2019-11-15",2482061,1103138,1378923,1654707,470049,"Nota S.C.E. 76715123/19"]
[null,null,"2019-11-16",2482061,1103138,1378923,1654707,470049,"Nota S.C.E. 76715123/19"]
[null,null,"2019-11-17",2482061,1103138,1378923,1654707,470049,"Nota S.C.E. 76715123/19"]
[null,null,"2019-11-18",2482061,1103138,1378923,1654707,470049,"Nota S.C.E. 76715123/19"]
[null,null,"2019-11-19",2482061,1103138,1378923,1654707,470049,"Nota S.C.E. 76715123/19"]
[null,null,"2019-11-20",2482061,1103138,1378923,1654707,470049,"Nota S.C.E. 76715123/19"]
[null,null,"2019-11-21",2482061,1103138,1378923,1654707,470049,"Nota S.C.E. 76715123/19"]
[null,null,"2019-11-22",2482061,1103138,1378923,1654707,470049,"Nota S.C.E. 76715123/19"]
[null,null,"2019-11-23",2482061,1103138,1378923,1654707,470049,"Nota S.C.E. 76715123/19"]
[null,null,"2019-11-24",2482061,1103138,1378923,1654707,470049,"Nota S.C.E. 76715123/19"]
[null,null,"2019-11-25",2482061,1103138,1378923,1654707,470049,"Nota S.C.E. 76715123/19"]
[null,null,"2019-11-26",2482061,1103138,1378923,1654707,470049,"Nota S.C.E. 76715123/19"]
[null,null,"2019-11-27",2482061,1103138,1378923,1654707,470049,"Nota S.C.E. 76715123/19"]
[null,null,"2019-11-28",2482061,1103138,1378923,1654707,470049,"Nota S.C.E. 76715123/19"]
[null,null,"2019-11-29",2482061,1103138,1378923,1654707,470049,"Nota S.C.E. 76715123/19"]
[null,null,"2019-11-30",2482061,1103138,1378923,1654707,470049,"Nota S.C.E. 76715123/19"]
[null,null,"2019-12-01",2482061,1103138,1378923,1654707,470049,"Nota S.C.E. 76715123/19"]
[null,null,"2019-12-02",2482061,1103138,1378923,1654707,470049,"Nota S.C.E. 76715123/19"]
[null,null,"2019-12-03",2482061,1103138,1378923,1654707,470049,"Nota S.C.E. 76715123/19"]
[null,null,"2019-12-04",2482061,1103138,1378923,1654707,470049,"Nota S.C.E. 76715123/19"]
[null,null,"2019-12-05",2482061,1103138,1378923,1654707,470049,"Nota S.C.E. 76715123/19"]
[null,null,"2019-12-06",2482061,1103138,1378923,1654707,470049,"Nota S.C.E. 76715123/19"]
[null,null,"2019-12-07",2482061,1103138,1378923,1654707,470049,"Nota S.C.E. 76715123/19"]
[null,null,"2019-12-08",2482061,1103138,1378923,1654707,470049,"Nota S.C.E. 76715123/19"]
[null,null,"2019-12-09",2482061,1103138,1378923,1654707,470049,"Nota S.C.E. 76715123/19"]
[null,null,"2019-12-10",2482061,1103138,1378923,1654707,470049,"Nota S.C.E. 76715123/19"]
[null,null,"2019-12-11",2482061,1103138,1378923,1654707,470049,"Nota S.C.E. 76715123/19"]
[null,null,"2019-12-12",2482061,1103138,1378923,1654707,470049,"Nota S.C.E. 76715123/19"]
[null,null,"2019-12-13",2482061,1103138,1378923,1654707,470049,"Nota S.C.E. 76715123/19"]
[null,null,"2019-12-14",2482061,1103138,1378923,1654707,470049,"Nota S.C.E. 76715123/19"]
[null,null,"2019-12-15",2482061,1103138,1378923,1654707,470049,"Nota S.C.E. 76715123/19"]
[null,null,"2019-12-16",2482061,1103138,1378923,1654707,470049,"Nota S.C.E. 76715123/19"]
[null,null,"2019-12-17",2482061,1103138,1378923,1654707,470049,"Nota S.C.E. 76715123/19"]
[null,null,"2019-12-18",2482061,1103138,1378923,1654707,470049,"Nota S.C.E. 76715123/19"]
[null,null,"2019-12-19",2482061,1103138,1378923,1654707,470049,"Nota S.C.E. 76715123/19"]
[null,null,"2019-12-20",2482061,1103138,1378923,1654707,470049,"Nota S.C.E. 76715123/19"]
[null,null,"2019-12-21",2482061,1103138,1378923,1654707,470049,"Nota S.C.E. 76715123/19"]
[null,null,"2019-12-22",2482061,1103138,1378923,1654707,470049,"Nota S.C.E. 76715123/19"]
[null,null,"2019-12-23",2482061,1103138,1378923,1654707,470049,"Nota S.C.E. 76715123/19"]
[null,null,"2019-12-24",2482061,1103138,1378923,1654707,470049,"Nota S.C.E. 76715123/19"]
[null,null,"2019-12-25",2482061,1103138,1378923,1654707,470049,"Nota S.C.E. 76715123/19"]
[null,null,"2019-12-26",2482061,1103138,1378923,1654707,470049,"Nota S.C.E. 76715123/19"]
[null,null,"2019-12-27",2482061,1103138,1378923,1654707,470049,"Nota S.C.E. 76715123/19"]
[null,null,"2019-12-28",2482061,1103138,1378923,1654707,470049,"Nota S.C.E. 76715123/19"]
[null,null,"2019-12-29",2482061,1103138,1378923,1654707,470049,"Nota S.C.E. 76715123/19"]
[null,null,"2019-12-30",2482061,1103138,1378923,1654707,470049,"Nota S.C.E. 76715123/19"]
[null,null,"2019-12-31",2482061,1103138,1378923,1654707,470049,"Nota S.C.E. 76715123/19"]
[null,null,"2020-01-01",2482061,1103138,1378923,1654707,470049,"Nota S.C.E. 76715123/19"]
[null,null,"2020-01-02",2482061,1103138,1378923,1654707,470049,"Nota S.C.E. 76715123/19"]
[null,null,"2020-01-03",2482061,1103138,1378923,1654707,470049,"Nota S.C.E. 76715123/19"]
[null,null,"2020-01-04",2482061,1103138,1378923,1654707,470049,"Nota S.C.E. 76715123/19"]
[null,null,"2020-01-05",2482061,1103138,1378923,1654707,470049,"Nota S.C.E. 76715123/19"]
[null,null,"2020-01-06",2482061,1103138,1378923,1654707,470049,"Nota S.C.E. 76715123/19"]
[null,null,"2020-01-07",2482061,1103138,1378923,1654707,470049,"Nota S.C.E. 76715123/19"]
[null,null,"2020-01-08",2482061,1103138,1378923,1654707,470049,"Nota S.C.E. 76715123/19"]
[null,null,"2020-01-09",2482061,1103138,1378923,1654707,470049,"Nota S.C.E. 76715123/19"]
[null,null,"2020-01-10",2482061,1103138,1378923,1654707,470049,"Nota S.C.E. 76715123/19"]
[null,null,"2020-01-11",2482061,1103138,1378923,1654707,470049,"Nota S.C.E. 76715123/19"]
[null,null,"2020-01-12",2482061,1103138,1378923,1654707,470049,"Nota S.C.E. 76715123/19"]
[null,null,"2020-01-13",2482061,1103138,1378923,1654707,470049,"Nota S.C.E. 76715123/19"]
[null,null,"2020-01-14",2482061,1103138,1378923,1654707,470049,"Nota S.C.E. 76715123/19"]
[null,null,"2020-01-15",2482061,1103138,1378923,1654707,470049,"Nota S.C.E. 76715123/19"]
[null,null,"2020-01-16",2482061,1103138,1378923,1654707,470049,"Nota S.C.E. 76715123/19"]
[null,null,"2020-01-17",2482061,1103138,1378923,1654707,470049,"Nota S.C.E. 76715123/19"]
[null,null,"2020-01-18",2482061,1103138,1378923,1654707,470049,"Nota S.C.E. 76715123/19"]
[null,null,"2020-01-19",2482061,1103138,1378923,1654707,470049,"Nota S.C.E. 76715123/19"]
[null,null,"2020-01-20",2482061,1103138,1378923,1654707,470049,"Nota S.C.E. 76715123/19"]
[null,null,"2020-01-21",2482061,1103138,1378923,1654707,470049,"Nota S.C.E. 76715123/19"]
[null,null,"2020-01-22",2482061,1103138,1378923,1654707,470049,"Nota S.C.E. 76715123/19"]
[null,null,"2020-01-23",2482061,1103138,1378923,1654707,470049,"Nota S.C.E. 76715123/19"]
[null,null,"2020-01-24",2482061,1103138,1378923,1654707,470049,"Nota S.C.E. 76715123/19"]
[null,null,"2020-01-25",2482061,1103138,1378923,1654707,470049,"Nota S.C.E. 76715123/19"]
[null,null,"2020-01-26",2482061,1103138,1378923,1654707,470049,"Nota S.C.E. 76715123/19"]
[null,null,"2020-01-27",2482061,1103138,1378923,1654707,470049,"Nota S.C.E. 76715123/19"]
[null,null,"2020-01-28",2482061,1103138,1378923,1654707,470049,"Nota S.C.E. 76715123/19"]
[null,null,"2020-01-29",2482061,1103138,1378923,1654707,470049,"Nota S.C.E. 76715123/19"]
[null,null,"2020-01-30",2482061,1103138,1378923,1654707,470049,"Nota S.C.E. 76715123/19"]
[null,null,"2020-01-31",2482061,1103138,1378923,1654707,470049,"Nota S.C.E. 76715123/19"]
[null,null,"2020-02-01",2482061,1103138,1378923,1654707,470049,"Nota S.C.E. 76715123/19"]
[null,null,"2020-02-02",2482061,1103138,1378923,1654707,470049,"Nota S.C.E. 76715123/19"]
[null,null,"2020-02-03",2482061,1103138,1378923,1654707,470049,"Nota S.C.E. 76715123/19"]
[null,null,"2020-02-04",2482061,1103138,1378923,1654707,470049,"Nota S.C.E. 76715123/19"]
[null,null,"2020-02-05",2482061,1103138,1378923,1654707,470049,"Nota S.C.E. 76715123/19"]
[null,null,"2020-02-06",2482061,1103138,1378923,1654707,470049,"Nota S.C.E. 76715123/19"]
[null,null,"2020-02-07",2482061,1103138,1378923,1654707,470049,"Nota S.C.E. 76715123/19"]
[null,null,"2020-02-08",2482061,1103138,1378923,1654707,470049,"Nota S.C.E. 76715123/19"]
[null,null,"2020-02-09",2482061,1103138,1378923,1654707,470049,"Nota S.C.E. 76715123/19"]
[null,null,"2020-02-10",2482061,1103138,1378923,1654707,470049,"Nota S.C.E. 76715123/19"]
[null,null,"2020-02-11",2482061,1103138,1378923,1654707,470049,"Nota S.C.E. 76715123/19"]
[null,null,"2020-02-12",2482061,1103138,1378923,1654707,470049,"Nota S.C.E. 76715123/19"]
[null,null,"2020-02-13",2482061,1103138,1378923,1654707,470049,"Nota S.C.E. 76715123/19"]
[null,null,"2020-02-14",2482061,1103138,1378923,1654707,470049,"Nota S.C.E. 76715123/19"]
[null,null,"2020-02-15",2482061,1103138,1378923,1654707,470049,"Nota S.C.E. 76715123/19"]
[null,null,"2020-02-16",2482061,1103138,1378923,1654707,470049,"Nota S.C.E. 76715123/19"]
[null,null,"2020-02-17",2482061,1103138,1378923,1654707,470049,"Nota S.C.E. 76715123/19"]
[null,null,"2020-02-18",2482061,1103138,1378923,1654707,470049,"Nota S.C.E. 76715123/19"]
[null,null,"2020-02-19",2482061,1103138,1378923,1654707,470049,"Nota S.C.E. 76715123/19"]
[null,null,"2020-02-20",2482061,1103138,1378923,1654707,470049,"Nota S.C.E. 76715123/19"]
[null,null,"2020-02-21",2482061,1103138,1378923,1654707,470049,"Nota S.C.E. 76715123/19"]
[null,null,"2020-02-22",2482061,1103138,1378923,1654707,470049,"Nota S.C.E. 76715123/19"]
[null,null,"2020-02-23",2482061,1103138,1378923,1654707,470049,"Nota S.C.E. 76715123/19"]
[null,null,"2020-02-24",2482061,1103138,1378923,1654707,470049,"Nota S.C.E. 76715123/19"]
[null,null,"2020-02-25",2482061,1103138,1378923,1654707,470049,"Nota S.C.E. 76715123/19"]
[null,null,"2020-02-26",2482061,1103138,1378923,1654707,470049,"Nota S.C.E. 76715123/19"]
[null,null,"2020-02-27",2482061,1103138,1378923,1654707,470049,"Nota S.C.E. 76715123/19"]
[null,null,"2020-02-28",2482061,1103138,1378923,1654707,470049,"Nota S.C.E. 76715123/19"]
[null,null,"2020-02-29",2482061,1103138,1378923,1654707,470049,"Nota S.C.E. 76715123/19"]
[null,null,"2020-03-01",2958970,1315098,1643873,1972647,560365,"Res. S.R.T. 24/2020"]
[null,null,"2020-03-02",2958970,1315098,1643873,1972647,560365,"Res. S.R.T. 24/2020"]
[null,null,"2020-03-03",2958970,1315098,1643873,1972647,560365,"Res. S.R.T. 24/2020"]
[null,null,"2020-03-04",2958970,1315098,1643873,1972647,560365,"Res. S.R.T. 24/2020"]
[null,null,"2020-03-05",2958970,1315098,1643873,1972647,560365,"Res. S.R.T. 24/2020"]
[null,null,"2020-03-06",2958970,1315098,1643873,1972647,560365,"Res. S.R.T. 24/2020"]
[null,null,"2020-03-07",2958970,1315098,1643873,1972647,560365,"Res. S.R.T. 24/2020"]
[null,null,"2020-03-08",2958970,1315098,1643873,1972647,560365,"Res. S.R.T. 24/2020"]
[null,null,"2020-03-09",2958970,1315098,1643873,1972647,560365,"Res. S.R.T. 24/2020"]
[null,null,"2020-03-10",2958970,1315098,1643873,1972647,560365,"Res. S.R.T. 24/2020"]
[null,null,"2020-03-11",2958970,1315098,1643873,1972647,560365,"Res. S.R.T. 24/2020"]
[null,null,"2020-03-12",2958970,1315098,1643873,1972647,560365,"Res. S.R.T. 24/2020"]
[null,null,"2020-03-13",2958970,1315098,1643873,1972647,560365,"Res. S.R.T. 24/2020"]
[null,null,"2020-03-14",2958970,1315098,1643873,1972647,560365,"Res. S.R.T. 24/2020"]
[null,null,"2020-03-15",2958970,1315098,1643873,1972647,560365,"Res. S.R.T. 24/2020"]
[null,null,"2020-03-16",2958970,1315098,1643873,1972647,560365,"Res. S.R.T. 24/2020"]
[null,null,"2020-03-17",2958970,1315098,1643873,1972647,560365,"Res. S.R.T. 24/2020"]
[null,null,"2020-03-18",2958970,1315098,1643873,1972647,560365,"Res. S.R.T. 24/2020"]
[null,null,"2020-03-19",2958970,1315098,1643873,1972647,560365,"Res. S.R.T. 24/2020"]
[null,null,"2020-03-20",2958970,1315098,1643873,1972647,560365,"Res. S.R.T. 24/2020"]
[null,null,"2020-03-21",2958970,1315098,1643873,1972647,560365,"Res. S.R.T. 24/2020"]
[null,null,"2020-03-22",2958970,1315098,1643873,1972647,560365,"Res. S.R.T. 24/2020"]
[null,null,"2020-03-23",2958970,1315098,1643873,1972647,560365,"Res. S.R.T. 24/2020"]
[null,null,"2020-03-24",2958970,1315098,1643873,1972647,560365,"Res. S.R.T. 24/2020"]
[null,null,"2020-03-25",2958970,1315098,1643873,1972647,560365,"Res. S.R.T. 24/2020"]
[null,null,"2020-03-26",2958970,1315098,1643873,1972647,560365,"Res. S.R.T. 24/2020"]
[null,null,"2020-03-27",2958970,1315098,1643873,1972647,560365,"Res. S.R.T. 24/2020"]
[null,null,"2020-03-28",2958970,1315098,1643873,1972647,560365,"Res. S.R.T. 24/2020"]
[null,null,"2020-03-29",2958970,1315098,1643873,1972647,560365,"Res. S.R.T. 24/2020"]
[null,null,"2020-03-30",2958970,1315098,1643873,1972647,560365,"Res. S.R.T. 24/2020"]
[null,null,"2020-03-31",2958970,1315098,1643873,1972647,560365,"Res. S.R.T. 24/2020"]
[null,null,"2020-04-01",2958970,1315098,1643873,1972647,560365,"Res. S.R.T. 24/2020"]
[null,null,"2020-04-02",2958970,1315098,1643873,1972647,560365,"Res. S.R.T. 24/2020"]
[null,null,"2020-04-03",2958970,1315098,1643873,1972647,560365,"Res. S.R.T. 24/2020"]
[null,null,"2020-04-04",2958970,1315098,1643873,1972647,560365,"Res. S.R.T. 24/2020"]
[null,null,"2020-04-05",2958970,1315098,1643873,1972647,560365,"Res. S.R.T. 24/2020"]
[null,null,"2020-04-06",2958970,1315098,1643873,1972647,560365,"Res. S.R.T. 24/2020"]
[null,null,"2020-04-07",2958970,1315098,1643873,1972647,560365,"Res. S.R.T. 24/2020"]
[null,null,"2020-04-08",2958970,1315098,1643873,1972647,560365,"Res. S.R.T. 24/2020"]
[null,null,"2020-04-09",2958970,1315098,1643873,1972647,560365,"Res. S.R.T. 24/2020"]
[null,null,"2020-04-10",2958970,1315098,1643873,1972647,560365,"Res. S.R.T. 24/2020"]
[null,null,"2020-04-11",2958970,1315098,1643873,1972647,560365,"Res. S.R.T. 24/2020"]
[null,null,"2020-04-12",2958970,1315098,1643873,1972647,560365,"Res. S.R.T. 24/2020"]
[null,null,"2020-04-13",2958970,1315098,1643873,1972647,560365,"Res. S.R.T. 24/2020"]
[null,null,"2020-04-14",2958970,1315098,1643873,1972647,560365,"Res. S.R.T. 24/2020"]
[null,null,"2020-04-15",2958970,1315098,1643873,1972647,560365,"Res. S.R.T. 24/2020"]
[null,null,"2020-04-16",2958970,1315098,1643873,1972647,560365,"Res. S.R.T. 24/2020"]
[null,null,"2020-04-17",2958970,1315098,1643873,1972647,560365,"Res. S.R.T. 24/2020"]
[null,null,"2020-04-18",2958970,1315098,1643873,1972647,560365,"Res. S.R.T. 24/2020"]
[null,null,"2020-04-19",2958970,1315098,1643873,1972647,560365,"Res. S.R.T. 24/2020"]
[null,null,"2020-04-20",2958970,1315098,1643873,1972647,560365,"Res. S.R.T. 24/2020"]
[null,null,"2020-04-21",2958970,1315098,1643873,1972647,560365,"Res. S.R.T. 24/2020"]
[null,null,"2020-04-22",2958970,1315098,1643873,1972647,560365,"Res. S.R.T. 24/2020"]
[null,null,"2020-04-23",2958970,1315098,1643873,1972647,560365,"Res. S.R.T. 24/2020"]
[null,null,"2020-04-24",2958970,1315098,1643873,1972647,560365,"Res. S.R.T. 24/2020"]
[null,null,"2020-04-25",2958970,1315098,1643873,1972647,560365,"Res. S.R.T. 24/2020"]
[null,null,"2020-04-26",2958970,1315098,1643873,1972647,560365,"Res. S.R.T. 24/2020"]
[null,null,"2020-04-27",2958970,1315098,1643873,1972647,560365,"Res. S.R.T. 24/2020"]
[null,null,"2020-04-28",2958970,1315098,1643873,1972647,560365,"Res. S.R.T. 24/2020"]
[null,null,"2020-04-29",2958970,1315098,1643873,1972647,560365,"Res. S.R.T. 24/2020"]
[null,null,"2020-04-30",2958970,1315098,1643873,1972647,560365,"Res. S.R.T. 24/2020"]
[null,null,"2020-05-01",2958970,1315098,1643873,1972647,560365,"Res. S.R.T. 24/2020"]
[null,null,"2020-05-02",2958970,1315098,1643873,1972647,560365,"Res. S.R.T. 24/2020"]
[null,null,"2020-05-03",2958970,1315098,1643873,1972647,560365,"Res. S.R.T. 24/2020"]
[null,null,"2020-05-04",2958970,1315098,1643873,1972647,560365,"Res. S.R.T. 24/2020"]
[null,null,"2020-05-05",2958970,1315098,1643873,1972647,560365,"Res. S.R.T. 24/2020"]
[null,null,"2020-05-06",2958970,1315098,1643873,1972647,560365,"Res. S.R.T. 24/2020"]
[null,null,"2020-05-07",2958970,1315098,1643873,1972647,560365,"Res. S.R.T. 24/2020"]
[null,null,"2020-05-08",2958970,1315098,1643873,1972647,560365,"Res. S.R.T. 24/2020"]
[null,null,"2020-05-09",2958970,1315098,1643873,1972647,560365,"Res. S.R.T. 24/2020"]
[null,null,"2020-05-10",2958970,1315098,1643873,1972647,560365,"Res. S.R.T. 24/2020"]
[null,null,"2020-05-11",2958970,1315098,1643873,1972647,560365,"Res. S.R.T. 24/2020"]
[null,null,"2020-05-12",2958970,1315098,1643873,1972647,560365,"Res. S.R.T. 24/2020"]
[null,null,"2020-05-13",2958970,1315098,1643873,1972647,560365,"Res. S.R.T. 24/2020"]
[null,null,"2020-05-14",2958970,1315098,1643873,1972647,560365,"Res. S.R.T. 24/2020"]
[null,null,"2020-05-15",2958970,1315098,1643873,1972647,560365,"Res. S.R.T. 24/2020"]
[null,null,"2020-05-16",2958970,1315098,1643873,1972647,560365,"Res. S.R.T. 24/2020"]
[null,null,"2020-05-17",2958970,1315098,1643873,1972647,560365,"Res. S.R.T. 24/2020"]
[null,null,"2020-05-18",2958970,1315098,1643873,1972647,560365,"Res. S.R.T. 24/2020"]
[null,null,"2020-05-19",2958970,1315098,1643873,1972647,560365,"Res. S.R.T. 24/2020"]
[null,null,"2020-05-20",2958970,1315098,1643873,1972647,560365,"Res. S.R.T. 24/2020"]
[null,null,"2020-05-21",2958970,1315098,1643873,1972647,560365,"Res. S.R.T. 24/2020"]
[null,null,"2020-05-22",2958970,1315098,1643873,1972647,560365,"Res. S.R.T. 24/2020"]
[null,null,"2020-05-23",2958970,1315098,1643873,1972647,560365,"Res. S.R.T. 24/2020"]
[null,null,"2020-05-24",2958970,1315098,1643873,1972647,560365,"Res. S.R.T. 24/2020"]
[null,null,"2020-05-25",2958970,1315098,1643873,1972647,560365,"Res. S.R.T. 24/2020"]
[null,null,"2020-05-26",2958970,1315098,1643873,1972647,560365,"Res. S.R.T. 24/2020"]
[null,null,"2020-05-27",2958970,1315098,1643873,1972647,560365,"Res. S.R.T. 24/2020"]
[null,null,"2020-05-28",2958970,1315098,1643873,1972647,560365,"Res. S.R.T. 24/2020"]
[null,null,"2020-05-29",2958970,1315098,1643873,1972647,560365,"Res. S.R.T. 24/2020"]
[null,null,"2020-05-30",2958970,1315098,1643873,1972647,560365,"Res. S.R.T. 24/2020"]
[null,null,"2020-05-31",2958970,1315098,1643873,1972647,560365,"Res. S.R.T. 24/2020"]
[null,null,"2020-06-01",2958970,1315098,1643873,1972647,560365,"Res. S.R.T. 24/2020"]
[null,null,"2020-06-02",2958970,1315098,1643873,1972647,560365,"Res. S.R.T. 24/2020"]
[null,null,"2020-06-03",2958970,1315098,1643873,1972647,560365,"Res. S.R.T. 24/2020"]
[null,null,"2020-06-04",2958970,1315098,1643873,1972647,560365,"Res. S.R.T. 24/2020"]
[null,null,"2020-06-05",2958970,1315098,1643873,1972647,560365,"Res. S.R.T. 24/2020"]
[null,null,"2020-06-06",2958970,1315098,1643873,1972647,560365,"Res. S.R.T. 24/2020"]
[null,null,"2020-06-07",2958970,1315098,1643873,1972647,560365,"Res. S.R.T. 24/2020"]
[null,null,"2020-06-08",2958970,1315098,1643873,1972647,560365,"Res. S.R.T. 24/2020"]
[null,null,"2020-06-09",2958970,1315098,1643873,1972647,560365,"Res. S.R.T. 24/2020"]
[null,null,"2020-06-10",2958970,1315098,1643873,1972647,560365,"Res. S.R.T. 24/2020"]
[null,null,"2020-06-11",2958970,1315098,1643873,1972647,560365,"Res. S.R.T. 24/2020"]
[null,null,"2020-06-12",2958970,1315098,1643873,1972647,560365,"Res. S.R.T. 24/2020"]
[null,null,"2020-06-13",2958970,1315098,1643873,1972647,560365,"Res. S.R.T. 24/2020"]
[null,null,"2020-06-14",2958970,1315098,1643873,1972647,560365,"Res. S.R.T. 24/2020"]
[null,null,"2020-06-15",2958970,1315098,1643873,1972647,560365,"Res. S.R.T. 24/2020"]
[null,null,"2020-06-16",2958970,1315098,1643873,1972647,560365,"Res. S.R.T. 24/2020"]
[null,null,"2020-06-17",2958970,1315098,1643873,1972647,560365,"Res. S.R.T. 24/2020"]
[null,null,"2020-06-18",2958970,1315098,1643873,1972647,560365,"Res. S.R.T. 24/2020"]
[null,null,"2020-06-19",2958970,1315098,1643873,1972647,560365,"Res. S.R.T. 24/2020"]
[null,null,"2020-06-20",2958970,1315098,1643873,1972647,560365,"Res. S.R.T. 24/2020"]
[null,null,"2020-06-21",2958970,1315098,1643873,1972647,560365,"Res. S.R.T. 24/2020"]
[null,null,"2020-06-22",2958970,1315098,1643873,1972647,560365,"Res. S.R.T. 24/2020"]
[null,null,"2020-06-23",2958970,1315098,1643873,1972647,560365,"Res. S.R.T. 24/2020"]
[null,null,"2020-06-24",2958970,1315098,1643873,1972647,560365,"Res. S.R.T. 24/2020"]
[null,null,"2020-06-25",2958970,1315098,1643873,1972647,560365,"Res. S.R.T. 24/2020"]
[null,null,"2020-06-26",2958970,1315098,1643873,1972647,560365,"Res. S.R.T. 24/2020"]
[null,null,"2020-06-27",2958970,1315098,1643873,1972647,560365,"Res. S.R.T. 24/2020"]
[null,null,"2020-06-28",2958970,1315098,1643873,1972647,560365,"Res. S.R.T. 24/2020"]
[null,null,"2020-06-29",2958970,1315098,1643873,1972647,560365,"Res. S.R.T. 24/2020"]
[null,null,"2020-06-30",2958970,1315098,1643873,1972647,560365,"Res. S.R.T. 24/2020"]
[null,null,"2020-07-01",2958970,1315098,1643873,1972647,560365,"Res. S.R.T. 24/2020"]
[null,null,"2020-07-02",2958970,1315098,1643873,1972647,560365,"Res. S.R.T. 24/2020"]
[null,null,"2020-07-03",2958970,1315098,1643873,1972647,560365,"Res. S.R.T. 24/2020"]
[null,null,"2020-07-04",2958970,1315098,1643873,1972647,560365,"Res. S.R.T. 24/2020"]
[null,null,"2020-07-05",2958970,1315098,1643873,1972647,560365,"Res. S.R.T. 24/2020"]
[null,null,"2020-07-06",2958970,1315098,1643873,1972647,560365,"Res. S.R.T. 24/2020"]
[null,null,"2020-07-07",2958970,1315098,1643873,1972647,560365,"Res. S.R.T. 24/2020"]
[null,null,"2020-07-08",2958970,1315098,1643873,1972647,560365,"Res. S.R.T. 24/2020"]
[null,null,"2020-07-09",2958970,1315098,1643873,1972647,560365,"Res. S.R.T. 24/2020"]
[null,null,"2020-07-10",2958970,1315098,1643873,1972647,560365,"Res. S.R.T. 24/2020"]
[null,null,"2020-07-11",2958970,1315098,1643873,1972647,560365,"Res. S.R.T. 24/2020"]
[null,null,"2020-07-12",2958970,1315098,1643873,1972647,560365,"Res. S.R.T. 24/2020"]
[null,null,"2020-07-13",2958970,1315098,1643873,1972647,560365,"Res. S.R.T. 24/2020"]
[null,null,"2020-07-14",2958970,1315098,1643873,1972647,560365,"Res. S.R.T. 24/2020"]
[null,null,"2020-07-15",2958970,1315098,1643873,1972647,560365,"Res. S.R.T. 24/2020"]
[null,null,"2020-07-16",2958970,1315098,1643873,1972647,560365,"Res. S.R.T. 24/2020"]
[null,null,"2020-07-17",2958970,1315098,1643873,1972647,560365,"Res. S.R.T. 24/2020"]
[null,null,"2020-07-18",2958970,1315098,1643873,1972647,560365,"Res. S.R.T. 24/2020"]
[null,null,"2020-07-19",2958970,1315098,1643873,1972647,560365,"Res. S.R.T. 24/2020"]
[null,null,"2020-07-20",2958970,1315098,1643873,1972647,560365,"Res. S.R.T. 24/2020"]
[null,null,"2020-07-21",2958970,1315098,1643873,1972647,560365,"Res. S.R.T. 24/2020"]
[null,null,"2020-07-22",2958970,1315098,1643873,1972647,560365,"Res. S.R.T. 24/2020"]
[null,null,"2020-07-23",2958970,1315098,1643873,1972647,560365,"Res. S.R.T. 24/2020"]
[null,null,"2020-07-24",2958970,1315098,1643873,1972647,560365,"Res. S.R.T. 24/2020"]
[null,null,"2020-07-25",2958970,1315098,1643873,1972647,560365,"Res. S.R.T. 24/2020"]
[null,null,"2020-07-26",2958970,1315098,1643873,1972647,560365,"Res. S.R.T. 24/2020"]
[null,null,"2020-07-27",2958970,1315098,1643873,1972647,560365,"Res. S.R.T. 24/2020"]
[null,null,"2020-07-28",2958970,1315098,1643873,1972647,560365,"Res. S.R.T. 24/2020"]
[null,null,"2020-07-29",2958970,1315098,1643873,1972647,560365,"Res. S.R.T. 24/2020"]
[null,null,"2020-07-30",2958970,1315098,1643873,1972647,560365,"Res. S.R.T. 24/2020"]
[null,null,"2020-07-31",2958970,1315098,1643873,1972647,560365,"Res. S.R.T. 24/2020"]
[null,null,"2020-08-01",2958970,1315098,1643873,1972647,560365,"Res. S.R.T. 24/2020"]
[null,null,"2020-08-02",2958970,1315098,1643873,1972647,560365,"Res. S.R.T. 24/2020"]
[null,null,"2020-08-03",2958970,1315098,1643873,1972647,560365,"Res. S.R.T. 24/2020"]
[null,null,"2020-08-04",2958970,1315098,1643873,1972647,560365,"Res. S.R.T. 24/2020"]
[null,null,"2020-08-05",2958970,1315098,1643873,1972647,560365,"Res. S.R.T. 24/2020"]
[null,null,"2020-08-06",2958970,1315098,1643873,1972647,560365,"Res. S.R.T. 24/2020"]
[null,null,"2020-08-07",2958970,1315098,1643873,1972647,560365,"Res. S.R.T. 24/2020"]
[null,null,"2020-08-08",2958970,1315098,1643873,1972647,560365,"Res. S.R.T. 24/2020"]
[null,null,"2020-08-09",2958970,1315098,1643873,1972647,560365,"Res. S.R.T. 24/2020"]
[null,null,"2020-08-10",2958970,1315098,1643873,1972647,560365,"Res. S.R.T. 24/2020"]
[null,null,"2020-08-11",2958970,1315098,1643873,1972647,560365,"Res. S.R.T. 24/2020"]
[null,null,"2020-08-12",2958970,1315098,1643873,1972647,560365,"Res. S.R.T. 24/2020"]
[null,null,"2020-08-13",2958970,1315098,1643873,1972647,560365,"Res. S.R.T. 24/2020"]
[null,null,"2020-08-14",2958970,1315098,1643873,1972647,560365,"Res. S.R.T. 24/2020"]
[null,null,"2020-08-15",2958970,1315098,1643873,1972647,560365,"Res. S.R.T. 24/2020"]
[null,null,"2020-08-16",2958970,1315098,1643873,1972647,560365,"Res. S.R.T. 24/2020"]
[null,null,"2020-08-17",2958970,1315098,1643873,1972647,560365,"Res. S.R.T. 24/2020"]
[null,null,"2020-08-18",2958970,1315098,1643873,1972647,560365,"Res. S.R.T. 24/2020"]
[null,null,"2020-08-19",2958970,1315098,1643873,1972647,560365,"Res. S.R.T. 24/2020"]
[null,null,"2020-08-20",2958970,1315098,1643873,1972647,560365,"Res. S.R.T. 24/2020"]
[null,null,"2020-08-21",2958970,1315098,1643873,1972647,560365,"Res. S.R.T. 24/2020"]
[null,null,"2020-08-22",2958970,1315098,1643873,1972647,560365,"Res. S.R.T. 24/2020"]
[null,null,"2020-08-23",2958970,1315098,1643873,1972647,560365,"Res. S.R.T. 24/2020"]
[null,null,"2020-08-24",2958970,1315098,1643873,1972647,560365,"Res. S.R.T. 24/2020"]
[null,null,"2020-08-25",2958970,1315098,1643873,1972647,560365,"Res. S.R.T. 24/2020"]
[null,null,"2020-08-26",2958970,1315098,1643873,1972647,560365,"Res. S.R.T. 24/2020"]
[null,null,"2020-08-27",2958970,1315098,1643873,1972647,560365,"Res. S.R.T. 24/2020"]
[null,null,"2020-08-28",2958970,1315098,1643873,1972647,560365,"Res. S.R.T. 24/2020"]
[null,null,"2020-08-29",2958970,1315098,1643873,1972647,560365,"Res. S.R.T. 24/2020"]
[null,null,"2020-08-30",2958970,1315098,1643873,1972647,560365,"Res. S.R.T. 24/2020"]
[null,null,"2020-08-31",2958970,1315098,1643873,1972647,560365,"Res. S.R.T. 24/2020"]
[null,null,"2020-09-01",3483482,1548214,1935268,2322321,659697,"Res. S.R.T. 70/2020"]
[null,null,"2020-09-02",3483482,1548214,1935268,2322321,659697,"Res. S.R.T. 70/2020"]
[null,null,"2020-09-03",3483482,1548214,1935268,2322321,659697,"Res. S.R.T. 70/2020"]
[null,null,"2020-09-04",3483482,1548214,1935268,2322321,659697,"Res. S.R.T. 70/2020"]
[null,null,"2020-09-05",3483482,1548214,1935268,2322321,659697,"Res. S.R.T. 70/2020"]
[null,null,"2020-09-06",3483482,1548214,1935268,2322321,659697,"Res. S.R.T. 70/2020"]
[null,null,"2020-09-07",3483482,1548214,1935268,2322321,659697,"Res. S.R.T. 70/2020"]
[null,null,"2020-09-08",3483482,1548214,1935268,2322321,659697,"Res. S.R.T. 70/2020"]
[null,null,"2020-09-09",3483482,1548214,1935268,2322321,659697,"Res. S.R.T. 70/2020"]
[null,null,"2020-09-10",3483482,1548214,1935268,2322321,659697,"Res. S.R.T. 70/2020"]
[null,null,"2020-09-11",3483482,1548214,1935268,2322321,659697,"Res. S.R.T. 70/2020"]
[null,null,"2020-09-12",3483482,1548214,1935268,2322321,659697,"Res. S.R.T. 70/2020"]
[null,null,"2020-09-13",3483482,1548214,1935268,2322321,659697,"Res. S.R.T. 70/2020"]
[null,null,"2020-09-14",3483482,1548214,1935268,2322321,659697,"Res. S.R.T. 70/2020"]
[null,null,"2020-09-15",3483482,1548214,1935268,2322321,659697,"Res. S.R.T. 70/2020"]
[null,null,"2020-09-16",3483482,1548214,1935268,2322321,659697,"Res. S.R.T. 70/2020"]
[null,null,"2020-09-17",3483482,1548214,1935268,2322321,659697,"Res. S.R.T. 70/2020"]
[null,null,"2020-09-18",3483482,1548214,1935268,2322321,659697,"Res. S.R.T. 70/2020"]
[null,null,"2020-09-19",3483482,1548214,1935268,2322321,659697,"Res. S.R.T. 70/2020"]
[null,null,"2020-09-20",3483482,1548214,1935268,2322321,659697,"Res. S.R.T. 70/2020"]
[null,null,"2020-09-21",3483482,1548214,1935268,2322321,659697,"Res. S.R.T. 70/2020"]
[null,null,"2020-09-22",3483482,1548214,1935268,2322321,659697,"Res. S.R.T. 70/2020"]
[null,null,"2020-09-23",3483482,1548214,1935268,2322321,659697,"Res. S.R.T. 70/2020"]
[null,null,"2020-09-24",3483482,1548214,1935268,2322321,659697,"Res. S.R.T. 70/2020"]
[null,null,"2020-09-25",3483482,1548214,1935268,2322321,659697,"Res. S.R.T. 70/2020"]
[null,null,"2020-09-26",3483482,1548214,1935268,2322321,659697,"Res. S.R.T. 70/2020"]
[null,null,"2020-09-27",3483482,1548214,1935268,2322321,659697,"Res. S.R.T. 70/2020"]
[null,null,"2020-09-28",3483482,1548214,1935268,2322321,659697,"Res. S.R.T. 70/2020"]
[null,null,"2020-09-29",3483482,1548214,1935268,2322321,659697,"Res. S.R.T. 70/2020"]
[null,null,"2020-09-30",3483482,1548214,1935268,2322321,659697,"Res. S.R.T. 70/2020"]
[null,null,"2020-10-01",3483482,1548214,1935268,2322321,659697,"Res. S.R.T. 70/2020"]
[null,null,"2020-10-02",3483482,1548214,1935268,2322321,659697,"Res. S.R.T. 70/2020"]
[null,null,"2020-10-03",3483482,1548214,1935268,2322321,659697,"Res. S.R.T. 70/2020"]
[null,null,"2020-10-04",3483482,1548214,1935268,2322321,659697,"Res. S.R.T. 70/2020"]
[null,null,"2020-10-05",3483482,1548214,1935268,2322321,659697,"Res. S.R.T. 70/2020"]
[null,null,"2020-10-06",3483482,1548214,1935268,2322321,659697,"Res. S.R.T. 70/2020"]
[null,null,"2020-10-07",3483482,1548214,1935268,2322321,659697,"Res. S.R.T. 70/2020"]
[null,null,"2020-10-08",3483482,1548214,1935268,2322321,659697,"Res. S.R.T. 70/2020"]
[null,null,"2020-10-09",3483482,1548214,1935268,2322321,659697,"Res. S.R.T. 70/2020"]
[null,null,"2020-10-10",3483482,1548214,1935268,2322321,659697,"Res. S.R.T. 70/2020"]
[null,null,"2020-10-11",3483482,1548214,1935268,2322321,659697,"Res. S.R.T. 70/2020"]
[null,null,"2020-10-12",3483482,1548214,1935268,2322321,659697,"Res. S.R.T. 70/2020"]
[null,null,"2020-10-13",3483482,1548214,1935268,2322321,659697,"Res. S.R.T. 70/2020"]
[null,null,"2020-10-14",3483482,1548214,1935268,2322321,659697,"Res. S.R.T. 70/2020"]
[null,null,"2020-10-15",3483482,1548214,1935268,2322321,659697,"Res. S.R.T. 70/2020"]
[null,null,"2020-10-16",3483482,1548214,1935268,2322321,659697,"Res. S.R.T. 70/2020"]
[null,null,"2020-10-17",3483482,1548214,1935268,2322321,659697,"Res. S.R.T. 70/2020"]
[null,null,"2020-10-18",3483482,1548214,1935268,2322321,659697,"Res. S.R.T. 70/2020"]
[null,null,"2020-10-19",3483482,1548214,1935268,2322321,659697,"Res. S.R.T. 70/2020"]
[null,null,"2020-10-20",3483482,1548214,1935268,2322321,659697,"Res. S.R.T. 70/2020"]
[null,null,"2020-10-21",3483482,1548214,1935268,2322321,659697,"Res. S.R.T. 70/2020"]
[null,null,"2020-10-22",3483482,1548214,1935268,2322321,659697,"Res. S.R.T. 70/2020"]
[null,null,"2020-10-23",3483482,1548214,1935268,2322321,659697,"Res. S.R.T. 70/2020"]
[null,null,"2020-10-24",3483482,1548214,1935268,2322321,659697,"Res. S.R.T. 70/2020"]
[null,null,"2020-10-25",3483482,1548214,1935268,2322321,659697,"Res. S.R.T. 70/2020"]
[null,null,"2020-10-26",3483482,1548214,1935268,2322321,659697,"Res. S.R.T. 70/2020"]
[null,null,"2020-10-27",3483482,1548214,1935268,2322321,659697,"Res. S.R.T. 70/2020"]
[null,null,"2020-10-28",3483482,1548214,1935268,2322321,659697,"Res. S.R.T. 70/2020"]
[null,null,"2020-10-29",3483482,1548214,1935268,2322321,659697,"Res. S.R.T. 70/2020"]
[null,null,"2020-10-30",3483482,1548214,1935268,2322321,659697,"Res. S.R.T. 70/2020"]
[null,null,"2020-10-31",3483482,1548214,1935268,2322321,659697,"Res. S.R.T. 70/2020"]
[null,null,"2020-11-01",3483482,1548214,1935268,2322321,659697,"Res. S.R.T. 70/2020"]
[null,null,"2020-11-02",3483482,1548214,1935268,2322321,659697,"Res. S.R.T. 70/2020"]
[null,null,"2020-11-03",3483482,1548214,1935268,2322321,659697,"Res. S.R.T. 70/2020"]
[null,null,"2020-11-04",3483482,1548214,1935268,2322321,659697,"Res. S.R.T. 70/2020"]
[null,null,"2020-11-05",3483482,1548214,1935268,2322321,659697,"Res. S.R.T. 70/2020"]
[null,null,"2020-11-06",3483482,1548214,1935268,2322321,659697,"Res. S.R.T. 70/2020"]
[null,null,"2020-11-07",3483482,1548214,1935268,2322321,659697,"Res. S.R.T. 70/2020"]
[null,null,"2020-11-08",3483482,1548214,1935268,2322321,659697,"Res. S.R.T. 70/2020"]
[null,null,"2020-11-09",3483482,1548214,1935268,2322321,659697,"Res. S.R.T. 70/2020"]
[null,null,"2020-11-10",3483482,1548214,1935268,2322321,659697,"Res. S.R.T. 70/2020"]
[null,null,"2020-11-11",3483482,1548214,1935268,2322321,659697,"Res. S.R.T. 70/2020"]
[null,null,"2020-11-12",3483482,1548214,1935268,2322321,659697,"Res. S.R.T. 70/2020"]
[null,null,"2020-11-13",3483482,1548214,1935268,2322321,659697,"Res. S.R.T. 70/2020"]
[null,null,"2020-11-14",3483482,1548214,1935268,2322321,659697,"Res. S.R.T. 70/2020"]
[null,null,"2020-11-15",3483482,1548214,1935268,2322321,659697,"Res. S.R.T. 70/2020"]
[null,null,"2020-11-16",3483482,1548214,1935268,2322321,659697,"Res. S.R.T. 70/2020"]
[null,null,"2020-11-17",3483482,1548214,1935268,2322321,659697,"Res. S.R.T. 70/2020"]
[null,null,"2020-11-18",3483482,1548214,1935268,2322321,659697,"Res. S.R.T. 70/2020"]
[null,null,"2020-11-19",3483482,1548214,1935268,2322321,659697,"Res. S.R.T. 70/2020"]
[null,null,"2020-11-20",3483482,1548214,1935268,2322321,659697,"Res. S.R.T. 70/2020"]
[null,null,"2020-11-21",3483482,1548214,1935268,2322321,659697,"Res. S.R.T. 70/2020"]
[null,null,"2020-11-22",3483482,1548214,1935268,2322321,659697,"Res. S.R.T. 70/2020"]
[null,null,"2020-11-23",3483482,1548214,1935268,2322321,659697,"Res. S.R.T. 70/2020"]
[null,null,"2020-11-24",3483482,1548214,1935268,2322321,659697,"Res. S.R.T. 70/2020"]
[null,null,"2020-11-25",3483482,1548214,1935268,2322321,659697,"Res. S.R.T. 70/2020"]
[null,null,"2020-11-26",3483482,1548214,1935268,2322321,659697,"Res. S.R.T. 70/2020"]
[null,null,"2020-11-27",3483482,1548214,1935268,2322321,659697,"Res. S.R.T. 70/2020"]
[null,null,"2020-11-28",3483482,1548214,1935268,2322321,659697,"Res. S.R.T. 70/2020"]
[null,null,"2020-11-29",3483482,1548214,1935268,2322321,659697,"Res. S.R.T. 70/2020"]
[null,null,"2020-11-30",3483482,1548214,1935268,2322321,659697,"Res. S.R.T. 70/2020"]
[null,null,"2020-12-01",3483482,1548214,1935268,2322321,659697,"Res. S.R.T. 70/2020"]
[null,null,"2020-12-02",3483482,1548214,1935268,2322321,659697,"Res. S.R.T. 70/2020"]
[null,null,"2020-12-03",3483482,1548214,1935268,2322321,659697,"Res. S.R.T. 70/2020"]
[null,null,"2020-12-04",3483482,1548214,1935268,2322321,659697,"Res. S.R.T. 70/2020"]
[null,null,"2020-12-05",3483482,1548214,1935268,2322321,659697,"Res. S.R.T. 70/2020"]
[null,null,"2020-12-06",3483482,1548214,1935268,2322321,659697,"Res. S.R.T. 70/2020"]
[null,null,"2020-12-07",3483482,1548214,1935268,2322321,659697,"Res. S.R.T. 70/2020"]
[null,null,"2020-12-08",3483482,1548214,1935268,2322321,659697,"Res. S.R.T. 70/2020"]
[null,null,"2020-12-09",3483482,1548214,1935268,2322321,659697,"Res. S.R.T. 70/2020"]
[null,null,"2020-12-10",3483482,1548214,1935268,2322321,659697,"Res. S.R.T. 70/2020"]
[null,null,"2020-12-11",3483482,1548214,1935268,2322321,659697,"Res. S.R.T. 70/2020"]
[null,null,"2020-12-12",3483482,1548214,1935268,2322321,659697,"Res. S.R.T. 70/2020"]
[null,null,"2020-12-13",3483482,1548214,1935268,2322321,659697,"Res. S.R.T. 70/2020"]
[null,null,"2020-12-14",3483482,1548214,1935268,2322321,659697,"Res. S.R.T. 70/2020"]
[null,null,"2020-12-15",3483482,1548214,1935268,2322321,659697,"Res. S.R.T. 70/2020"]
[null,null,"2020-12-16",3483482,1548214,1935268,2322321,659697,"Res. S.R.T. 70/2020"]
[null,null,"2020-12-17",3483482,1548214,1935268,2322321,659697,"Res. S.R.T. 70/2020"]
[null,null,"2020-12-18",3483482,1548214,1935268,2322321,659697,"Res. S.R.T. 70/2020"]
[null,null,"2020-12-19",3483482,1548214,1935268,2322321,659697,"Res. S.R.T. 70/2020"]
[null,null,"2020-12-20",3483482,1548214,1935268,2322321,659697,"Res. S.R.T. 70/2020"]
[null,null,"2020-12-21",3483482,1548214,1935268,2322321,659697,"Res. S.R.T. 70/2020"]
[null,null,"2020-12-22",3483482,1548214,1935268,2322321,659697,"Res. S.R.T. 70/2020"]
[null,null,"2020-12-23",3483482,1548214,1935268,2322321,659697,"Res. S.R.T. 70/2020"]
[null,null,"2020-12-24",3483482,1548214,1935268,2322321,659697,"Res. S.R.T. 70/2020"]
[null,null,"2020-12-25",3483482,1548214,1935268,2322321,659697,"Res. S.R.T. 70/2020"]
[null,null,"2020-12-26",3483482,1548214,1935268,2322321,659697,"Res. S.R.T. 70/2020"]
[null,null,"2020-12-27",3483482,1548214,1935268,2322321,659697,"Res. S.R.T. 70/2020"]
[null,null,"2020-12-28",3483482,1548214,1935268,2322321,659697,"Res. S.R.T. 70/2020"]
[null,null,"2020-12-29",3483482,1548214,1935268,2322321,659697,"Res. S.R.T. 70/2020"]
[null,null,"2020-12-30",3483482,1548214,1935268,2322321,659697,"Res. S.R.T. 70/2020"]
[null,null,"2020-12-31",3483482,1548214,1935268,2322321,659697,"Res. S.R.T. 70/2020"]
[null,null,"2021-01-01",3483482,1548214,1935268,2322321,659697,"Res. S.R.T. 70/2020"]
[null,null,"2021-01-02",3483482,1548214,1935268,2322321,659697,"Res. S.R.T. 70/2020"]
[null,null,"2021-01-03",3483482,1548214,1935268,2322321,659697,"Res. S.R.T. 70/2020"]
[null,null,"2021-01-04",3483482,1548214,1935268,2322321,659697,"Res. S.R.T. 70/2020"]
[null,null,"2021-01-05",3483482,1548214,1935268,2322321,659697,"Res. S.R.T. 70/2020"]
[null,null,"2021-01-06",3483482,1548214,1935268,2322321,659697,"Res. S.R.T. 70/2020"]
[null,null,"2021-01-07",3483482,1548214,1935268,2322321,659697,"Res. S.R.T. 70/2020"]
[null,null,"2021-01-08",3483482,1548214,1935268,2322321,659697,"Res. S.R.T. 70/2020"]
[null,null,"2021-01-09",3483482,1548214,1935268,2322321,659697,"Res. S.R.T. 70/2020"]
[null,null,"2021-01-10",3483482,1548214,1935268,2322321,659697,"Res. S.R.T. 70/2020"]
[null,null,"2021-01-11",3483482,1548214,1935268,2322321,659697,"Res. S.R.T. 70/2020"]
[null,null,"2021-01-12",3483482,1548214,1935268,2322321,659697,"Res. S.R.T. 70/2020"]
[null,null,"2021-01-13",3483482,1548214,1935268,2322321,659697,"Res. S.R.T. 70/2020"]
[null,null,"2021-01-14",3483482,1548214,1935268,2322321,659697,"Res. S.R.T. 70/2020"]
[null,null,"2021-01-15",3483482,1548214,1935268,2322321,659697,"Res. S.R.T. 70/2020"]
[null,null,"2021-01-16",3483482,1548214,1935268,2322321,659697,"Res. S.R.T. 70/2020"]
[null,null,"2021-01-17",3483482,1548214,1935268,2322321,659697,"Res. S.R.T. 70/2020"]
[null,null,"2021-01-18",3483482,1548214,1935268,2322321,659697,"Res. S.R.T. 70/2020"]
[null,null,"2021-01-19",3483482,1548214,1935268,2322321,659697,"Res. S.R.T. 70/2020"]
[null,null,"2021-01-20",3483482,1548214,1935268,2322321,659697,"Res. S.R.T. 70/2020"]
[null,null,"2021-01-21",3483482,1548214,1935268,2322321,659697,"Res. S.R.T. 70/2020"]
[null,null,"2021-01-22",3483482,1548214,1935268,2322321,659697,"Res. S.R.T. 70/2020"]
[null,null,"2021-01-23",3483482,1548214,1935268,2322321,659697,"Res. S.R.T. 70/2020"]
[null,null,"2021-01-24",3483482,1548214,1935268,2322321,659697,"Res. S.R.T. 70/2020"]
[null,null,"2021-01-25",3483482,1548214,1935268,2322321,659697,"Res. S.R.T. 70/2020"]
[null,null,"2021-01-26",3483482,1548214,1935268,2322321,659697,"Res. S.R.T. 70/2020"]
[null,null,"2021-01-27",3483482,1548214,1935268,2322321,659697,"Res. S.R.T. 70/2020"]
[null,null,"2021-01-28",3483482,1548214,1935268,2322321,659697,"Res. S.R.T. 70/2020"]
[null,null,"2021-01-29",3483482,1548214,1935268,2322321,659697,"Res. S.R.T. 70/2020"]
[null,null,"2021-01-30",3483482,1548214,1935268,2322321,659697,"Res. S.R.T. 70/2020"]
[null,null,"2021-01-31",3483482,1548214,1935268,2322321,659697,"Res. S.R.T. 70/2020"]
[null,null,"2021-02-01",3483482,1548214,1935268,2322321,659697,"Res. S.R.T. 70/2020"]
[null,null,"2021-02-02",3483482,1548214,1935268,2322321,659697,"Res. S.R.T. 70/2020"]
[null,null,"2021-02-03",3483482,1548214,1935268,2322321,659697,"Res. S.R.T. 70/2020"]
[null,null,"2021-02-04",3483482,1548214,1935268,2322321,659697,"Res. S.R.T. 70/2020"]
[null,null,"2021-02-05",3483482,1548214,1935268,2322321,659697,"Res. S.R.T. 70/2020"]
[null,null,"2021-02-06",3483482,1548214,1935268,2322321,659697,"Res. S.R.T. 70/2020"]
[null,null,"2021-02-07",3483482,1548214,1935268,2322321,659697,"Res. S.R.T. 70/2020"]
[null,null,"2021-02-08",3483482,1548214,1935268,2322321,659697,"Res. S.R.T. 70/2020"]
[null,null,"2021-02-09",3483482,1548214,1935268,2322321,659697,"Res. S.R.T. 70/2020"]
[null,null,"2021-02-10",3483482,1548214,1935268,2322321,659697,"Res. S.R.T. 70/2020"]
[null,null,"2021-02-11",3483482,1548214,1935268,2322321,659697,"Res. S.R.T. 70/2020"]
[null,null,"2021-02-12",3483482,1548214,1935268,2322321,659697,"Res. S.R.T. 70/2020"]
[null,null,"2021-02-13",3483482,1548214,1935268,2322321,659697,"Res. S.R.T. 70/2020"]
[null,null,"2021-02-14",3483482,1548214,1935268,2322321,659697,"Res. S.R.T. 70/2020"]
[null,null,"2021-02-15",3483482,1548214,1935268,2322321,659697,"Res. S.R.T. 70/2020"]
[null,null,"2021-02-16",3483482,1548214,1935268,2322321,659697,"Res. S.R.T. 70/2020"]
[null,null,"2021-02-17",3483482,1548214,1935268,2322321,659697,"Res. S.R.T. 70/2020"]
[null,null,"2021-02-18",3483482,1548214,1935268,2322321,659697,"Res. S.R.T. 70/2020"]
[null,null,"2021-02-19",3483482,1548214,1935268,2322321,659697,"Res. S.R.T. 70/2020"]
[null,null,"2021-02-20",3483482,1548214,1935268,2322321,659697,"Res. S.R.T. 70/2020"]
[null,null,"2021-02-21",3483482,1548214,1935268,2322321,659697,"Res. S.R.T. 70/2020"]
[null,null,"2021-02-22",3483482,1548214,1935268,2322321,659697,"Res. S.R.T. 70/2020"]
[null,null,"2021-02-23",3483482,1548214,1935268,2322321,659697,"Res. S.R.T. 70/2020"]
[null,null,"2021-02-24",3483482,1548214,1935268,2322321,659697,"Res. S.R.T. 70/2020"]
[null,null,"2021-02-25",3483482,1548214,1935268,2322321,659697,"Res. S.R.T. 70/2020"]
[null,null,"2021-02-26",3483482,1548214,1935268,2322321,659697,"Res. S.R.T. 70/2020"]
[null,null,"2021-02-27",3483482,1548214,1935268,2322321,659697,"Res. S.R.T. 70/2020"]
[null,null,"2021-02-28",3483482,1548214,1935268,2322321,659697,"Res. S.R.T. 70/2020"]
[null,null,"2021-03-01",3991300,1773911,2217389,2660866,755867,"Res. S.R.T. 7/2021"]
[null,null,"2021-03-02",3991300,1773911,2217389,2660866,755867,"Res. S.R.T. 7/2021"]
[null,null,"2021-03-03",3991300,1773911,2217389,2660866,755867,"Res. S.R.T. 7/2021"]
[null,null,"2021-03-04",3991300,1773911,2217389,2660866,755867,"Res. S.R.T. 7/2021"]
[null,null,"2021-03-05",3991300,1773911,2217389,2660866,755867,"Res. S.R.T. 7/2021"]
[null,null,"2021-03-06",3991300,1773911,2217389,2660866,755867,"Res. S.R.T. 7/2021"]
[null,null,"2021-03-07",3991300,1773911,2217389,2660866,755867,"Res. S.R.T. 7/2021"]
[null,null,"2021-03-08",3991300,1773911,2217389,2660866,755867,"Res. S.R.T. 7/2021"]
[null,null,"2021-03-09",3991300,1773911,2217389,2660866,755867,"Res. S.R.T. 7/2021"]
[null,null,"2021-03-10",3991300,1773911,2217389,2660866,755867,"Res. S.R.T. 7/2021"]
[null,null,"2021-03-11",3991300,1773911,2217389,2660866,755867,"Res. S.R.T. 7/2021"]
[null,null,"2021-03-12",3991300,1773911,2217389,2660866,755867,"Res. S.R.T. 7/2021"]
[null,null,"2021-03-13",3991300,1773911,2217389,2660866,755867,"Res. S.R.T. 7/2021"]
[null,null,"2021-03-14",3991300,1773911,2217389,2660866,755867,"Res. S.R.T. 7/2021"]
[null,null,"2021-03-15",3991300,1773911,2217389,2660866,755867,"Res. S.R.T. 7/2021"]
[null,null,"2021-03-16",3991300,1773911,2217389,2660866,755867,"Res. S.R.T. 7/2021"]
[null,null,"2021-03-17",3991300,1773911,2217389,2660866,755867,"Res. S.R.T. 7/2021"]
[null,null,"2021-03-18",3991300,1773911,2217389,2660866,755867,"Res. S.R.T. 7/2021"]
[null,null,"2021-03-19",3991300,1773911,2217389,2660866,755867,"Res. S.R.T. 7/2021"]
[null,null,"2021-03-20",3991300,1773911,2217389,2660866,755867,"Res. S.R.T. 7/2021"]
[null,null,"2021-03-21",3991300,1773911,2217389,2660866,755867,"Res. S.R.T. 7/2021"]
[null,null,"2021-03-22",3991300,1773911,2217389,2660866,755867,"Res. S.R.T. 7/2021"]
[null,null,"2021-03-23",3991300,1773911,2217389,2660866,755867,"Res. S.R.T. 7/2021"]
[null,null,"2021-03-24",3991300,1773911,2217389,2660866,755867,"Res. S.R.T. 7/2021"]
[null,null,"2021-03-25",3991300,1773911,2217389,2660866,755867,"Res. S.R.T. 7/2021"]
[null,null,"2021-03-26",3991300,1773911,2217389,2660866,755867,"Res. S.R.T. 7/2021"]
[null,null,"2021-03-27",3991300,1773911,2217389,2660866,755867,"Res. S.R.T. 7/2021"]
[null,null,"2021-03-28",3991300,1773911,2217389,2660866,755867,"Res. S.R.T. 7/2021"]
[null,null,"2021-03-29",3991300,1773911,2217389,2660866,755867,"Res. S.R.T. 7/2021"]
[null,null,"2021-03-30",3991300,1773911,2217389,2660866,755867,"Res. S.R.T. 7/2021"]
[null,null,"2021-03-31",3991300,1773911,2217389,2660866,755867,"Res. S.R.T. 7/2021"]
[null,null,"2021-04-01",3991300,1773911,2217389,2660866,755867,"Res. S.R.T. 7/2021"]
[null,null,"2021-04-02",3991300,1773911,2217389,2660866,755867,"Res. S.R.T. 7/2021"]
[null,null,"2021-04-03",3991300,1773911,2217389,2660866,755867,"Res. S.R.T. 7/2021"]
[null,null,"2021-04-04",3991300,1773911,2217389,2660866,755867,"Res. S.R.T. 7/2021"]
[null,null,"2021-04-05",3991300,1773911,2217389,2660866,755867,"Res. S.R.T. 7/2021"]
[null,null,"2021-04-06",3991300,1773911,2217389,2660866,755867,"Res. S.R.T. 7/2021"]
[null,null,"2021-04-07",3991300,1773911,2217389,2660866,755867,"Res. S.R.T. 7/2021"]
[null,null,"2021-04-08",3991300,1773911,2217389,2660866,755867,"Res. S.R.T. 7/2021"]
[null,null,"2021-04-09",3991300,1773911,2217389,2660866,755867,"Res. S.R.T. 7/2021"]
[null,null,"2021-04-10",3991300,1773911,2217389,2660866,755867,"Res. S.R.T. 7/2021"]
[null,null,"2021-04-11",3991300,1773911,2217389,2660866,755867,"Res. S.R.T. 7/2021"]
[null,null,"2021-04-12",3991300,1773911,2217389,2660866,755867,"Res. S.R.T. 7/2021"]
[null,null,"2021-04-13",3991300,1773911,2217389,2660866,755867,"Res. S.R.T. 7/2021"]
[null,null,"2021-04-14",3991300,1773911,2217389,2660866,755867,"Res. S.R.T. 7/2021"]
[null,null,"2021-04-15",3991300,1773911,2217389,2660866,755867,"Res. S.R.T. 7/2021"]
[null,null,"2021-04-16",3991300,1773911,2217389,2660866,755867,"Res. S.R.T. 7/2021"]
[null,null,"2021-04-17",3991300,1773911,2217389,2660866,755867,"Res. S.R.T. 7/2021"]
[null,null,"2021-04-18",3991300,1773911,2217389,2660866,755867,"Res. S.R.T. 7/2021"]
[null,null,"2021-04-19",3991300,1773911,2217389,2660866,755867,"Res. S.R.T. 7/2021"]
[null,null,"2021-04-20",3991300,1773911,2217389,2660866,755867,"Res. S.R.T. 7/2021"]
[null,null,"2021-04-21",3991300,1773911,2217389,2660866,755867,"Res. S.R.T. 7/2021"]
[null,null,"2021-04-22",3991300,1773911,2217389,2660866,755867,"Res. S.R.T. 7/2021"]
[null,null,"2021-04-23",3991300,1773911,2217389,2660866,755867,"Res. S.R.T. 7/2021"]
[null,null,"2021-04-24",3991300,1773911,2217389,2660866,755867,"Res. S.R.T. 7/2021"]
[null,null,"2021-04-25",3991300,1773911,2217389,2660866,755867,"Res. S.R.T. 7/2021"]
[null,null,"2021-04-26",3991300,1773911,2217389,2660866,755867,"Res. S.R.T. 7/2021"]
[null,null,"2021-04-27",3991300,1773911,2217389,2660866,755867,"Res. S.R.T. 7/2021"]
[null,null,"2021-04-28",3991300,1773911,2217389,2660866,755867,"Res. S.R.T. 7/2021"]
[null,null,"2021-04-29",3991300,1773911,2217389,2660866,755867,"Res. S.R.T. 7/2021"]
[null,null,"2021-04-30",3991300,1773911,2217389,2660866,755867,"Res. S.R.T. 7/2021"]
[null,null,"2021-05-01",3991300,1773911,2217389,2660866,755867,"Res. S.R.T. 7/2021"]
[null,null,"2021-05-02",3991300,1773911,2217389,2660866,755867,"Res. S.R.T. 7/2021"]
[null,null,"2021-05-03",3991300,1773911,2217389,2660866,755867,"Res. S.R.T. 7/2021"]
[null,null,"2021-05-04",3991300,1773911,2217389,2660866,755867,"Res. S.R.T. 7/2021"]
[null,null,"2021-05-05",3991300,1773911,2217389,2660866,755867,"Res. S.R.T. 7/2021"]
[null,null,"2021-05-06",3991300,1773911,2217389,2660866,755867,"Res. S.R.T. 7/2021"]
[null,null,"2021-05-07",3991300,1773911,2217389,2660866,755867,"Res. S.R.T. 7/2021"]
[null,null,"2021-05-08",3991300,1773911,2217389,2660866,755867,"Res. S.R.T. 7/2021"]
[null,null,"2021-05-09",3991300,1773911,2217389,2660866,755867,"Res. S.R.T. 7/2021"]
[null,null,"2021-05-10",3991300,1773911,2217389,2660866,755867,"Res. S.R.T. 7/2021"]
[null,null,"2021-05-11",3991300,1773911,2217389,2660866,755867,"Res. S.R.T. 7/2021"]
[null,null,"2021-05-12",3991300,1773911,2217389,2660866,755867,"Res. S.R.T. 7/2021"]
[null,null,"2021-05-13",3991300,1773911,2217389,2660866,755867,"Res. S.R.T. 7/2021"]
[null,null,"2021-05-14",3991300,1773911,2217389,2660866,755867,"Res. S.R.T. 7/2021"]
[null,null,"2021-05-15",3991300,1773911,2217389,2660866,755867,"Res. S.R.T. 7/2021"]
[null,null,"2021-05-16",3991300,1773911,2217389,2660866,755867,"Res. S.R.T. 7/2021"]
[null,null,"2021-05-17",3991300,1773911,2217389,2660866,755867,"Res. S.R.T. 7/2021"]
[null,null,"2021-05-18",3991300,1773911,2217389,2660866,755867,"Res. S.R.T. 7/2021"]
[null,null,"2021-05-19",3991300,1773911,2217389,2660866,755867,"Res. S.R.T. 7/2021"]
[null,null,"2021-05-20",3991300,1773911,2217389,2660866,755867,"Res. S.R.T. 7/2021"]
[null,null,"2021-05-21",3991300,1773911,2217389,2660866,755867,"Res. S.R.T. 7/2021"]
[null,null,"2021-05-22",3991300,1773911,2217389,2660866,755867,"Res. S.R.T. 7/2021"]
[null,null,"2021-05-23",3991300,1773911,2217389,2660866,755867,"Res. S.R.T. 7/2021"]
[null,null,"2021-05-24",3991300,1773911,2217389,2660866,755867,"Res. S.R.T. 7/2021"]
[null,null,"2021-05-25",3991300,1773911,2217389,2660866,755867,"Res. S.R.T. 7/2021"]
[null,null,"2021-05-26",3991300,1773911,2217389,2660866,755867,"Res. S.R.T. 7/2021"]
[null,null,"2021-05-27",3991300,1773911,2217389,2660866,755867,"Res. S.R.T. 7/2021"]
[null,null,"2021-05-28",3991300,1773911,2217389,2660866,755867,"Res. S.R.T. 7/2021"]
[null,null,"2021-05-29",3991300,1773911,2217389,2660866,755867,"Res. S.R.T. 7/2021"]
[null,null,"2021-05-30",3991300,1773911,2217389,2660866,755867,"Res. S.R.T. 7/2021"]
[null,null,"2021-05-31",3991300,1773911,2217389,2660866,755867,"Res. S.R.T. 7/2021"]
[null,null,"2021-06-01",3991300,1773911,2217389,2660866,755867,"Res. S.R.T. 7/2021"]
[null,null,"2021-06-02",3991300,1773911,2217389,2660866,755867,"Res. S.R.T. 7/2021"]
[null,null,"2021-06-03",3991300,1773911,2217389,2660866,755867,"Res. S.R.T. 7/2021"]
[null,null,"2021-06-04",3991300,1773911,2217389,2660866,755867,"Res. S.R.T. 7/2021"]
[null,null,"2021-06-05",3991300,1773911,2217389,2660866,755867,"Res. S.R.T. 7/2021"]
[null,null,"2021-06-06",3991300,1773911,2217389,2660866,755867,"Res. S.R.T. 7/2021"]
[null,null,"2021-06-07",3991300,1773911,2217389,2660866,755867,"Res. S.R.T. 7/2021"]
[null,null,"2021-06-08",3991300,1773911,2217389,2660866,755867,"Res. S.R.T. 7/2021"]
[null,null,"2021-06-09",3991300,1773911,2217389,2660866,755867,"Res. S.R.T. 7/2021"]
[null,null,"2021-06-10",3991300,1773911,2217389,2660866,755867,"Res. S.R.T. 7/2021"]
[null,null,"2021-06-11",3991300,1773911,2217389,2660866,755867,"Res. S.R.T. 7/2021"]
[null,null,"2021-06-12",3991300,1773911,2217389,2660866,755867,"Res. S.R.T. 7/2021"]
[null,null,"2021-06-13",3991300,1773911,2217389,2660866,755867,"Res. S.R.T. 7/2021"]
[null,null,"2021-06-14",3991300,1773911,2217389,2660866,755867,"Res. S.R.T. 7/2021"]
[null,null,"2021-06-15",3991300,1773911,2217389,2660866,755867,"Res. S.R.T. 7/2021"]
[null,null,"2021-06-16",3991300,1773911,2217389,2660866,755867,"Res. S.R.T. 7/2021"]
[null,null,"2021-06-17",3991300,1773911,2217389,2660866,755867,"Res. S.R.T. 7/2021"]
[null,null,"2021-06-18",3991300,1773911,2217389,2660866,755867,"Res. S.R.T. 7/2021"]
[null,null,"2021-06-19",3991300,1773911,2217389,2660866,755867,"Res. S.R.T. 7/2021"]
[null,null,"2021-06-20",3991300,1773911,2217389,2660866,755867,"Res. S.R.T. 7/2021"]
[null,null,"2021-06-21",3991300,1773911,2217389,2660866,755867,"Res. S.R.T. 7/2021"]
[null,null,"2021-06-22",3991300,1773911,2217389,2660866,755867,"Res. S.R.T. 7/2021"]
[null,null,"2021-06-23",3991300,1773911,2217389,2660866,755867,"Res. S.R.T. 7/2021"]
[null,null,"2021-06-24",3991300,1773911,2217389,2660866,755867,"Res. S.R.T. 7/2021"]
[null,null,"2021-06-25",3991300,1773911,2217389,2660866,755867,"Res. S.R.T. 7/2021"]
[null,null,"2021-06-26",3991300,1773911,2217389,2660866,755867,"Res. S.R.T. 7/2021"]
[null,null,"2021-06-27",3991300,1773911,2217389,2660866,755867,"Res. S.R.T. 7/2021"]
[null,null,"2021-06-28",3991300,1773911,2217389,2660866,755867,"Res. S.R.T. 7/2021"]
[null,null,"2021-06-29",3991300,1773911,2217389,2660866,755867,"Res. S.R.T. 7/2021"]
[null,null,"2021-06-30",3991300,1773911,2217389,2660866,755867,"Res. S.R.T. 7/2021"]
[null,null,"2021-07-01",3991300,1773911,2217389,2660866,755867,"Res. S.R.T. 7/2021"]
[null,null,"2021-07-02",3991300,1773911,2217389,2660866,755867,"Res. S.R.T. 7/2021"]
[null,null,"2021-07-03",3991300,1773911,2217389,2660866,755867,"Res. S.R.T. 7/2021"]
[null,null,"2021-07-04",3991300,1773911,2217389,2660866,755867,"Res. S.R.T. 7/2021"]
[null,null,"2021-07-05",3991300,1773911,2217389,2660866,755867,"Res. S.R.T. 7/2021"]
[null,null,"2021-07-06",3991300,1773911,2217389,2660866,755867,"Res. S.R.T. 7/2021"]
[null,null,"2021-07-07",3991300,1773911,2217389,2660866,755867,"Res. S.R.T. 7/2021"]
[null,null,"2021-07-08",3991300,1773911,2217389,2660866,755867,"Res. S.R.T. 7/2021"]
[null,null,"2021-07-09",3991300,1773911,2217389,2660866,755867,"Res. S.R.T. 7/2021"]
[null,null,"2021-07-10",3991300,1773911,2217389,2660866,755867,"Res. S.R.T. 7/2021"]
[null,null,"2021-07-11",3991300,1773911,2217389,2660866,755867,"Res. S.R.T. 7/2021"]
[null,null,"2021-07-12",3991300,1773911,2217389,2660866,755867,"Res. S.R.T. 7/2021"]
[null,null,"2021-07-13",3991300,1773911,2217389,2660866,755867,"Res. S.R.T. 7/2021"]
[null,null,"2021-07-14",3991300,1773911,2217389,2660866,755867,"Res. S.R.T. 7/2021"]
[null,null,"2021-07-15",3991300,1773911,2217389,2660866,755867,"Res. S.R.T. 7/2021"]
[null,null,"2021-07-16",3991300,1773911,2217389,2660866,755867,"Res. S.R.T. 7/2021"]
[null,null,"2021-07-17",3991300,1773911,2217389,2660866,755867,"Res. S.R.T. 7/2021"]
[null,null,"2021-07-18",3991300,1773911,2217389,2660866,755867,"Res. S.R.T. 7/2021"]
[null,null,"2021-07-19",3991300,1773911,2217389,2660866,755867,"Res. S.R.T. 7/2021"]
[null,null,"2021-07-20",3991300,1773911,2217389,2660866,755867,"Res. S.R.T. 7/2021"]
[null,null,"2021-07-21",3991300,1773911,2217389,2660866,755867,"Res. S.R.T. 7/2021"]
[null,null,"2021-07-22",3991300,1773911,2217389,2660866,755867,"Res. S.R.T. 7/2021"]
[null,null,"2021-07-23",3991300,1773911,2217389,2660866,755867,"Res. S.R.T. 7/2021"]
[null,null,"2021-07-24",3991300,1773911,2217389,2660866,755867,"Res. S.R.T. 7/2021"]
[null,null,"2021-07-25",3991300,1773911,2217389,2660866,755867,"Res. S.R.T. 7/2021"]
[null,null,"2021-07-26",3991300,1773911,2217389,2660866,755867,"Res. S.R.T. 7/2021"]
[null,null,"2021-07-27",3991300,1773911,2217389,2660866,755867,"Res. S.R.T. 7/2021"]
[null,null,"2021-07-28",3991300,1773911,2217389,2660866,755867,"Res. S.R.T. 7/2021"]
[null,null,"2021-07-29",3991300,1773911,2217389,2660866,755867,"Res. S.R.T. 7/2021"]
[null,null,"2021-07-30",3991300,1773911,2217389,2660866,755867,"Res. S.R.T. 7/2021"]
[null,null,"2021-07-31",3991300,1773911,2217389,2660866,755867,"Res. S.R.T. 7/2021"]
[null,null,"2021-08-01",3991300,1773911,2217389,2660866,755867,"Res. S.R.T. 7/2021"]
[null,null,"2021-08-02",3991300,1773911,2217389,2660866,755867,"Res. S.R.T. 7/2021"]
[null,null,"2021-08-03",3991300,1773911,2217389,2660866,755867,"Res. S.R.T. 7/2021"]
[null,null,"2021-08-04",3991300,1773911,2217389,2660866,755867,"Res. S.R.T. 7/2021"]
[null,null,"2021-08-05",3991300,1773911,2217389,2660866,755867,"Res. S.R.T. 7/2021"]
[null,null,"2021-08-06",3991300,1773911,2217389,2660866,755867,"Res. S.R.T. 7/2021"]
[null,null,"2021-08-07",3991300,1773911,2217389,2660866,755867,"Res. S.R.T. 7/2021"]
[null,null,"2021-08-08",3991300,1773911,2217389,2660866,755867,"Res. S.R.T. 7/2021"]
[null,null,"2021-08-09",3991300,1773911,2217389,2660866,755867,"Res. S.R.T. 7/2021"]
[null,null,"2021-08-10",3991300,1773911,2217389,2660866,755867,"Res. S.R.T. 7/2021"]
[null,null,"2021-08-11",3991300,1773911,2217389,2660866,755867,"Res. S.R.T. 7/2021"]
[null,null,"2021-08-12",3991300,1773911,2217389,2660866,755867,"Res. S.R.T. 7/2021"]
[null,null,"2021-08-13",3991300,1773911,2217389,2660866,755867,"Res. S.R.T. 7/2021"]
[null,null,"2021-08-14",3991300,1773911,2217389,2660866,755867,"Res. S.R.T. 7/2021"]
[null,null,"2021-08-15",3991300,1773911,2217389,2660866,755867,"Res. S.R.T. 7/2021"]
[null,null,"2021-08-16",3991300,1773911,2217389,2660866,755867,"Res. S.R.T. 7/2021"]
[null,null,"2021-08-17",3991300,1773911,2217389,2660866,755867,"Res. S.R.T. 7/2021"]
[null,null,"2021-08-18",3991300,1773911,2217389,2660866,755867,"Res. S.R.T. 7/2021"]
[null,null,"2021-08-19",3991300,1773911,2217389,2660866,755867,"Res. S.R.T. 7/2021"]
[null,null,"2021-08-20",3991300,1773911,2217389,2660866,755867,"Res. S.R.T. 7/2021"]
[null,null,"2021-08-21",3991300,1773911,2217389,2660866,755867,"Res. S.R.T. 7/2021"]
[null,null,"2021-08-22",3991300,1773911,2217389,2660866,755867,"Res. S.R.T. 7/2021"]
[null,null,"2021-08-23",3991300,1773911,2217389,2660866,755867,"Res. S.R.T. 7/2021"]
[null,null,"2021-08-24",3991300,1773911,2217389,2660866,755867,"Res. S.R.T. 7/2021"]
[null,null,"2021-08-25",3991300,1773911,2217389,2660866,755867,"Res. S.R.T. 7/2021"]
[null,null,"2021-08-26",3991300,1773911,2217389,2660866,755867,"Res. S.R.T. 7/2021"]
[null,null,"2021-08-27",3991300,1773911,2217389,2660866,755867,"Res. S.R.T. 7/2021"]
[null,null,"2021-08-28",3991300,1773911,2217389,2660866,755867,"Res. S.R.T. 7/2021"]
[null,null,"2021-08-29",3991300,1773911,2217389,2660866,755867,"Res. S.R.T. 7/2021"]
[null,null,"2021-08-30",3991300,1773911,2217389,2660866,755867,"Res. S.R.T. 7/2021"]
[null,null,"2021-08-31",3991300,1773911,2217389,2660866,755867,"Res. S.R.T. 7/2021"]
[null,null,"2021-09-01",5044408,2241959,2802449,3362938,955303,"Res. S.R.T. 49/2021"]
[null,null,"2021-09-02",5044408,2241959,2802449,3362938,955303,"Res. S.R.T. 49/2021"]
[null,null,"2021-09-03",5044408,2241959,2802449,3362938,955303,"Res. S.R.T. 49/2021"]
[null,null,"2021-09-04",5044408,2241959,2802449,3362938,955303,"Res. S.R.T. 49/2021"]
[null,null,"2021-09-05",5044408,2241959,2802449,3362938,955303,"Res. S.R.T. 49/2021"]
[null,null,"2021-09-06",5044408,2241959,2802449,3362938,955303,"Res. S.R.T. 49/2021"]
[null,null,"2021-09-07",5044408,2241959,2802449,3362938,955303,"Res. S.R.T. 49/2021"]
[null,null,"2021-09-08",5044408,2241959,2802449,3362938,955303,"Res. S.R.T. 49/2021"]
[null,null,"2021-09-09",5044408,2241959,2802449,3362938,955303,"Res. S.R.T. 49/2021"]
[null,null,"2021-09-10",5044408,2241959,2802449,3362938,955303,"Res. S.R.T. 49/2021"]
[null,null,"2021-09-11",5044408,2241959,2802449,3362938,955303,"Res. S.R.T. 49/2021"]
[null,null,"2021-09-12",5044408,2241959,2802449,3362938,955303,"Res. S.R.T. 49/2021"]
[null,null,"2021-09-13",5044408,2241959,2802449,3362938,955303,"Res. S.R.T. 49/2021"]
[null,null,"2021-09-14",5044408,2241959,2802449,3362938,955303,"Res. S.R.T. 49/2021"]
[null,null,"2021-09-15",5044408,2241959,2802449,3362938,955303,"Res. S.R.T. 49/2021"]
[null,null,"2021-09-16",5044408,2241959,2802449,3362938,955303,"Res. S.R.T. 49/2021"]
[null,null,"2021-09-17",5044408,2241959,2802449,3362938,955303,"Res. S.R.T. 49/2021"]
[null,null,"2021-09-18",5044408,2241959,2802449,3362938,955303,"Res. S.R.T. 49/2021"]
[null,null,"2021-09-19",5044408,2241959,2802449,3362938,955303,"Res. S.R.T. 49/2021"]
[null,null,"2021-09-20",5044408,2241959,2802449,3362938,955303,"Res. S.R.T. 49/2021"]
[null,null,"2021-09-21",5044408,2241959,2802449,3362938,955303,"Res. S.R.T. 49/2021"]
[null,null,"2021-09-22",5044408,2241959,2802449,3362938,955303,"Res. S.R.T. 49/2021"]
[null,null,"2021-09-23",5044408,2241959,2802449,3362938,955303,"Res. S.R.T. 49/2021"]
[null,null,"2021-09-24",5044408,2241959,2802449,3362938,955303,"Res. S.R.T. 49/2021"]
[null,null,"2021-09-25",5044408,2241959,2802449,3362938,955303,"Res. S.R.T. 49/2021"]
[null,null,"2021-09-26",5044408,2241959,2802449,3362938,955303,"Res. S.R.T. 49/2021"]
[null,null,"2021-09-27",5044408,2241959,2802449,3362938,955303,"Res. S.R.T. 49/2021"]
[null,null,"2021-09-28",5044408,2241959,2802449,3362938,955303,"Res. S.R.T. 49/2021"]
[null,null,"2021-09-29",5044408,2241959,2802449,3362938,955303,"Res. S.R.T. 49/2021"]
[null,null,"2021-09-30",5044408,2241959,2802449,3362938,955303,"Res. S.R.T. 49/2021"]
[null,null,"2021-10-01",5044408,2241959,2802449,3362938,955303,"Res. S.R.T. 49/2021"]
[null,null,"2021-10-02",5044408,2241959,2802449,3362938,955303,"Res. S.R.T. 49/2021"]
[null,null,"2021-10-03",5044408,2241959,2802449,3362938,955303,"Res. S.R.T. 49/2021"]
[null,null,"2021-10-04",5044408,2241959,2802449,3362938,955303,"Res. S.R.T. 49/2021"]
[null,null,"2021-10-05",5044408,2241959,2802449,3362938,955303,"Res. S.R.T. 49/2021"]
[null,null,"2021-10-06",5044408,2241959,2802449,3362938,955303,"Res. S.R.T. 49/2021"]
[null,null,"2021-10-07",5044408,2241959,2802449,3362938,955303,"Res. S.R.T. 49/2021"]
[null,null,"2021-10-08",5044408,2241959,2802449,3362938,955303,"Res. S.R.T. 49/2021"]
[null,null,"2021-10-09",5044408,2241959,2802449,3362938,955303,"Res. S.R.T. 49/2021"]
[null,null,"2021-10-10",5044408,2241959,2802449,3362938,955303,"Res. S.R.T. 49/2021"]
[null,null,"2021-10-11",5044408,2241959,2802449,3362938,955303,"Res. S.R.T. 49/2021"]
[null,null,"2021-10-12",5044408,2241959,2802449,3362938,955303,"Res. S.R.T. 49/2021"]
[null,null,"2021-10-13",5044408,2241959,2802449,3362938,955303,"Res. S.R.T. 49/2021"]
[null,null,"2021-10-14",5044408,2241959,2802449,3362938,955303,"Res. S.R.T. 49/2021"]
[null,null,"2021-10-15",5044408,2241959,2802449,3362938,955303,"Res. S.R.T. 49/2021"]
[null,null,"2021-10-16",5044408,2241959,2802449,3362938,955303,"Res. S.R.T. 49/2021"]
[null,null,"2021-10-17",5044408,2241959,2802449,3362938,955303,"Res. S.R.T. 49/2021"]
[null,null,"2021-10-18",5044408,2241959,2802449,3362938,955303,"Res. S.R.T. 49/2021"]
[null,null,"2021-10-19",5044408,2241959,2802449,3362938,955303,"Res. S.R.T. 49/2021"]
[null,null,"2021-10-20",5044408,2241959,2802449,3362938,955303,"Res. S.R.T. 49/2021"]
[null,null,"2021-10-21",5044408,2241959,2802449,3362938,955303,"Res. S.R.T. 49/2021"]
[null,null,"2021-10-22",5044408,2241959,2802449,3362938,955303,"Res. S.R.T. 49/2021"]
[null,null,"2021-10-23",5044408,2241959,2802449,3362938,955303,"Res. S.R.T. 49/2021"]
[null,null,"2021-10-24",5044408,2241959,2802449,3362938,955303,"Res. S.R.T. 49/2021"]
[null,null,"2021-10-25",5044408,2241959,2802449,3362938,955303,"Res. S.R.T. 49/2021"]
[null,null,"2021-10-26",5044408,2241959,2802449,3362938,955303,"Res. S.R.T. 49/2021"]
[null,null,"2021-10-27",5044408,2241959,2802449,3362938,955303,"Res. S.R.T. 49/2021"]
[null,null,"2021-10-28",5044408,2241959,2802449,3362938,955303,"Res. S.R.T. 49/2021"]
[null,null,"2021-10-29",5044408,2241959,2802449,3362938,955303,"Res. S.R.T. 49/2021"]
[null,null,"2021-10-30",5044408,2241959,2802449,3362938,955303,"Res. S.R.T. 49/2021"]
[null,null,"2021-10-31",5044408,2241959,2802449,3362938,955303,"Res. S.R.T. 49/2021"]
[null,null,"2021-11-01",5044408,2241959,2802449,3362938,955303,"Res. S.R.T. 49/2021"]
[null,null,"2021-11-02",5044408,2241959,2802449,3362938,955303,"Res. S.R.T. 49/2021"]
[null,null,"2021-11-03",5044408,2241959,2802449,3362938,955303,"Res. S.R.T. 49/2021"]
[null,null,"2021-11-04",5044408,2241959,2802449,3362938,955303,"Res. S.R.T. 49/2021"]
[null,null,"2021-11-05",5044408,2241959,2802449,3362938,955303,"Res. S.R.T. 49/2021"]
[null,null,"2021-11-06",5044408,2241959,2802449,3362938,955303,"Res. S.R.T. 49/2021"]
[null,null,"2021-11-07",5044408,2241959,2802449,3362938,955303,"Res. S.R.T. 49/2021"]
[null,null,"2021-11-08",5044408,2241959,2802449,3362938,955303,"Res. S.R.T. 49/2021"]
[null,null,"2021-11-09",5044408,2241959,2802449,3362938,955303,"Res. S.R.T. 49/2021"]
[null,null,"2021-11-10",5044408,2241959,2802449,3362938,955303,"Res. S.R.T. 49/2021"]
[null,null,"2021-11-11",5044408,2241959,2802449,3362938,955303,"Res. S.R.T. 49/2021"]
[null,null,"2021-11-12",5044408,2241959,2802449,3362938,955303,"Res. S.R.T. 49/2021"]
[null,null,"2021-11-13",5044408,2241959,2802449,3362938,955303,"Res. S.R.T. 49/2021"]
[null,null,"2021-11-14",5044408,2241959,2802449,3362938,955303,"Res. S.R.T. 49/2021"]
[null,null,"2021-11-15",5044408,2241959,2802449,3362938,955303,"Res. S.R.T. 49/2021"]
[null,null,"2021-11-16",5044408,2241959,2802449,3362938,955303,"Res. S.R.T. 49/2021"]
[null,null,"2021-11-17",5044408,2241959,2802449,3362938,955303,"Res. S.R.T. 49/2021"]
[null,null,"2021-11-18",5044408,2241959,2802449,3362938,955303,"Res. S.R.T. 49/2021"]
[null,null,"2021-11-19",5044408,2241959,2802449,3362938,955303,"Res. S.R.T. 49/2021"]
[null,null,"2021-11-20",5044408,2241959,2802449,3362938,955303,"Res. S.R.T. 49/2021"]
[null,null,"2021-11-21",5044408,2241959,2802449,3362938,955303,"Res. S.R.T. 49/2021"]
[null,null,"2021-11-22",5044408,2241959,2802449,3362938,955303,"Res. S.R.T. 49/2021"]
[null,null,"2021-11-23",5044408,2241959,2802449,3362938,955303,"Res. S.R.T. 49/2021"]
[null,null,"2021-11-24",5044408,2241959,2802449,3362938,955303,"Res. S.R.T. 49/2021"]
[null,null,"2021-11-25",5044408,2241959,2802449,3362938,955303,"Res. S.R.T. 49/2021"]
[null,null,"2021-11-26",5044408,2241959,2802449,3362938,955303,"Res. S.R.T. 49/2021"]
[null,null,"2021-11-27",5044408,2241959,2802449,3362938,955303,"Res. S.R.T. 49/2021"]
[null,null,"2021-11-28",5044408,2241959,2802449,3362938,955303,"Res. S.R.T. 49/2021"]
[null,null,"2021-11-29",5044408,2241959,2802449,3362938,955303,"Res. S.R.T. 49/2021"]
[null,null,"2021-11-30",5044408,2241959,2802449,3362938,955303,"Res. S.R.T. 49/2021"]
[null,null,"2021-12-01",5044408,2241959,2802449,3362938,955303,"Res. S.R.T. 49/2021"]
[null,null,"2021-12-02",5044408,2241959,2802449,3362938,955303,"Res. S.R.T. 49/2021"]
[null,null,"2021-12-03",5044408,2241959,2802449,3362938,955303,"Res. S.R.T. 49/2021"]
[null,null,"2021-12-04",5044408,2241959,2802449,3362938,955303,"Res. S.R.T. 49/2021"]
[null,null,"2021-12-05",5044408,2241959,2802449,3362938,955303,"Res. S.R.T. 49/2021"]
[null,null,"2021-12-06",5044408,2241959,2802449,3362938,955303,"Res. S.R.T. 49/2021"]
[null,null,"2021-12-07",5044408,2241959,2802449,3362938,955303,"Res. S.R.T. 49/2021"]
[null,null,"2021-12-08",5044408,2241959,2802449,3362938,955303,"Res. S.R.T. 49/2021"]
[null,null,"2021-12-09",5044408,2241959,2802449,3362938,955303,"Res. S.R.T. 49/2021"]
[null,null,"2021-12-10",5044408,2241959,2802449,3362938,955303,"Res. S.R.T. 49/2021"]
[null,null,"2021-12-11",5044408,2241959,2802449,3362938,955303,"Res. S.R.T. 49/2021"]
[null,null,"2021-12-12",5044408,2241959,2802449,3362938,955303,"Res. S.R.T. 49/2021"]
[null,null,"2021-12-13",5044408,2241959,2802449,3362938,955303,"Res. S.R.T. 49/2021"]
[null,null,"2021-12-14",5044408,2241959,2802449,3362938,955303,"Res. S.R.T. 49/2021"]
[null,null,"2021-12-15",5044408,2241959,2802449,3362938,955303,"Res. S.R.T. 49/2021"]
[null,null,"2021-12-16",5044408,2241959,2802449,3362938,955303,"Res. S.R.T. 49/2021"]
[null,null,"2021-12-17",5044408,2241959,2802449,3362938,955303,"Res. S.R.T. 49/2021"]
[null,null,"2021-12-18",5044408,2241959,2802449,3362938,955303,"Res. S.R.T. 49/2021"]
[null,null,"2021-12-19",5044408,2241959,2802449,3362938,955303,"Res. S.R.T. 49/2021"]
[null,null,"2021-12-20",5044408,2241959,2802449,3362938,955303,"Res. S.R.T. 49/2021"]
[null,null,"2021-12-21",5044408,2241959,2802449,3362938,955303,"Res. S.R.T. 49/2021"]
[null,null,"2021-12-22",5044408,2241959,2802449,3362938,955303,"Res. S.R.T. 49/2021"]
[null,null,"2021-12-23",5044408,2241959,2802449,3362938,955303,"Res. S.R.T. 49/2021"]
[null,null,"2021-12-24",5044408,2241959,2802449,3362938,955303,"Res. S.R.T. 49/2021"]
[null,null,"2021-12-25",5044408,2241959,2802449,3362938,955303,"Res. S.R.T. 49/2021"]
[null,null,"2021-12-26",5044408,2241959,2802449,3362938,955303,"Res. S.R.T. 49/2021"]
[null,null,"2021-12-27",5044408,2241959,2802449,3362938,955303,"Res. S.R.T. 49/2021"]
[null,null,"2021-12-28",5044408,2241959,2802449,3362938,955303,"Res. S.R.T. 49/2021"]
[null,null,"2021-12-29",5044408,2241959,2802449,3362938,955303,"Res. S.R.T. 49/2021"]
[null,null,"2021-12-30",5044408,2241959,2802449,3362938,955303,"Res. S.R.T. 49/2021"]
[null,null,"2021-12-31",5044408,2241959,2802449,3362938,955303,"Res. S.R.T. 49/2021"]
[null,null,"2022-01-01",5044408,2241959,2802449,3362938,955303,"Res. S.R.T. 49/2021"]
[null,null,"2022-01-02",5044408,2241959,2802449,3362938,955303,"Res. S.R.T. 49/2021"]
[null,null,"2022-01-03",5044408,2241959,2802449,3362938,955303,"Res. S.R.T. 49/2021"]
[null,null,"2022-01-04",5044408,2241959,2802449,3362938,955303,"Res. S.R.T. 49/2021"]
[null,null,"2022-01-05",5044408,2241959,2802449,3362938,955303,"Res. S.R.T. 49/2021"]
[null,null,"2022-01-06",5044408,2241959,2802449,3362938,955303,"Res. S.R.T. 49/2021"]
[null,null,"2022-01-07",5044408,2241959,2802449,3362938,955303,"Res. S.R.T. 49/2021"]
[null,null,"2022-01-08",5044408,2241959,2802449,3362938,955303,"Res. S.R.T. 49/2021"]
[null,null,"2022-01-09",5044408,2241959,2802449,3362938,955303,"Res. S.R.T. 49/2021"]
[null,null,"2022-01-10",5044408,2241959,2802449,3362938,955303,"Res. S.R.T. 49/2021"]
[null,null,"2022-01-11",5044408,2241959,2802449,3362938,955303,"Res. S.R.T. 49/2021"]
[null,null,"2022-01-12",5044408,2241959,2802449,3362938,955303,"Res. S.R.T. 49/2021"]
[null,null,"2022-01-13",5044408,2241959,2802449,3362938,955303,"Res. S.R.T. 49/2021"]
[null,null,"2022-01-14",5044408,2241959,2802449,3362938,955303,"Res. S.R.T. 49/2021"]
[null,null,"2022-01-15",5044408,2241959,2802449,3362938,955303,"Res. S.R.T. 49/2021"]
[null,null,"2022-01-16",5044408,2241959,2802449,3362938,955303,"Res. S.R.T. 49/2021"]
[null,null,"2022-01-17",5044408,2241959,2802449,3362938,955303,"Res. S.R.T. 49/2021"]
[null,null,"2022-01-18",5044408,2241959,2802449,3362938,955303,"Res. S.R.T. 49/2021"]
[null,null,"2022-01-19",5044408,2241959,2802449,3362938,955303,"Res. S.R.T. 49/2021"]
[null,null,"2022-01-20",5044408,2241959,2802449,3362938,955303,"Res. S.R.T. 49/2021"]
[null,null,"2022-01-21",5044408,2241959,2802449,3362938,955303,"Res. S.R.T. 49/2021"]
[null,null,"2022-01-22",5044408,2241959,2802449,3362938,955303,"Res. S.R.T. 49/2021"]
[null,null,"2022-01-23",5044408,2241959,2802449,3362938,955303,"Res. S.R.T. 49/2021"]
[null,null,"2022-01-24",5044408,2241959,2802449,3362938,955303,"Res. S.R.T. 49/2021"]
[null,null,"2022-01-25",5044408,2241959,2802449,3362938,955303,"Res. S.R.T. 49/2021"]
[null,null,"2022-01-26",5044408,2241959,2802449,3362938,955303,"Res. S.R.T. 49/2021"]
[null,null,"2022-01-27",5044408,2241959,2802449,3362938,955303,"Res. S.R.T. 49/2021"]
[null,null,"2022-01-28",5044408,2241959,2802449,3362938,955303,"Res. S.R.T. 49/2021"]
[null,null,"2022-01-29",5044408,2241959,2802449,3362938,955303,"Res. S.R.T. 49/2021"]
[null,null,"2022-01-30",5044408,2241959,2802449,3362938,955303,"Res. S.R.T. 49/2021"]
[null,null,"2022-01-31",5044408,2241959,2802449,3362938,955303,"Res. S.R.T. 49/2021"]
[null,null,"2022-02-01",5044408,2241959,2802449,3362938,955303,"Res. S.R.T. 49/2021"]
[null,null,"2022-02-02",5044408,2241959,2802449,3362938,955303,"Res. S.R.T. 49/2021"]
[null,null,"2022-02-03",5044408,2241959,2802449,3362938,955303,"Res. S.R.T. 49/2021"]
[null,null,"2022-02-04",5044408,2241959,2802449,3362938,955303,"Res. S.R.T. 49/2021"]
[null,null,"2022-02-05",5044408,2241959,2802449,3362938,955303,"Res. S.R.T. 49/2021"]
[null,null,"2022-02-06",5044408,2241959,2802449,3362938,955303,"Res. S.R.T. 49/2021"]
[null,null,"2022-02-07",5044408,2241959,2802449,3362938,955303,"Res. S.R.T. 49/2021"]
[null,null,"2022-02-08",5044408,2241959,2802449,3362938,955303,"Res. S.R.T. 49/2021"]
[null,null,"2022-02-09",5044408,2241959,2802449,3362938,955303,"Res. S.R.T. 49/2021"]
[null,null,"2022-02-10",5044408,2241959,2802449,3362938,955303,"Res. S.R.T. 49/2021"]
[null,null,"2022-02-11",5044408,2241959,2802449,3362938,955303,"Res. S.R.T. 49/2021"]
[null,null,"2022-02-12",5044408,2241959,2802449,3362938,955303,"Res. S.R.T. 49/2021"]
[null,null,"2022-02-13",5044408,2241959,2802449,3362938,955303,"Res. S.R.T. 49/2021"]
[null,null,"2022-02-14",5044408,2241959,2802449,3362938,955303,"Res. S.R.T. 49/2021"]
[null,null,"2022-02-15",5044408,2241959,2802449,3362938,955303,"Res. S.R.T. 49/2021"]
[null,null,"2022-02-16",5044408,2241959,2802449,3362938,955303,"Res. S.R.T. 49/2021"]
[null,null,"2022-02-17",5044408,2241959,2802449,3362938,955303,"Res. S.R.T. 49/2021"]
[null,null,"2022-02-18",5044408,2241959,2802449,3362938,955303,"Res. S.R.T. 49/2021"]
[null,null,"2022-02-19",5044408,2241959,2802449,3362938,955303,"Res. S.R.T. 49/2021"]
[null,null,"2022-02-20",5044408,2241959,2802449,3362938,955303,"Res. S.R.T. 49/2021"]
[null,null,"2022-02-21",5044408,2241959,2802449,3362938,955303,"Res. S.R.T. 49/2021"]
[null,null,"2022-02-22",5044408,2241959,2802449,3362938,955303,"Res. S.R.T. 49/2021"]
[null,null,"2022-02-23",5044408,2241959,2802449,3362938,955303,"Res. S.R.T. 49/2021"]
[null,null,"2022-02-24",5044408,2241959,2802449,3362938,955303,"Res. S.R.T. 49/2021"]
[null,null,"2022-02-25",5044408,2241959,2802449,3362938,955303,"Res. S.R.T. 49/2021"]
[null,null,"2022-02-26",5044408,2241959,2802449,3362938,955303,"Res. S.R.T. 49/2021"]
[null,null,"2022-02-27",5044408,2241959,2802449,3362938,955303,"Res. S.R.T. 49/2021"]
[null,null,"2022-02-28",5044408,2241959,2802449,3362938,955303,"Res. S.R.T. 49/2021"]
[null,null,"2022-03-01",6123338,2721484,3401855,4082225,1159629,"Res. S.R.T. 15/2022"]
[null,null,"2022-03-02",6123338,2721484,3401855,4082225,1159629,"Res. S.R.T. 15/2022"]
[null,null,"2022-03-03",6123338,2721484,3401855,4082225,1159629,"Res. S.R.T. 15/2022"]
[null,null,"2022-03-04",6123338,2721484,3401855,4082225,1159629,"Res. S.R.T. 15/2022"]
[null,null,"2022-03-05",6123338,2721484,3401855,4082225,1159629,"Res. S.R.T. 15/2022"]
[null,null,"2022-03-06",6123338,2721484,3401855,4082225,1159629,"Res. S.R.T. 15/2022"]
[null,null,"2022-03-07",6123338,2721484,3401855,4082225,1159629,"Res. S.R.T. 15/2022"]
[null,null,"2022-03-08",6123338,2721484,3401855,4082225,1159629,"Res. S.R.T. 15/2022"]
[null,null,"2022-03-09",6123338,2721484,3401855,4082225,1159629,"Res. S.R.T. 15/2022"]
[null,null,"2022-03-10",6123338,2721484,3401855,4082225,1159629,"Res. S.R.T. 15/2022"]
[null,null,"2022-03-11",6123338,2721484,3401855,4082225,1159629,"Res. S.R.T. 15/2022"]
[null,null,"2022-03-12",6123338,2721484,3401855,4082225,1159629,"Res. S.R.T. 15/2022"]
[null,null,"2022-03-13",6123338,2721484,3401855,4082225,1159629,"Res. S.R.T. 15/2022"]
[null,null,"2022-03-14",6123338,2721484,3401855,4082225,1159629,"Res. S.R.T. 15/2022"]
[null,null,"2022-03-15",6123338,2721484,3401855,4082225,1159629,"Res. S.R.T. 15/2022"]
[null,null,"2022-03-16",6123338,2721484,3401855,4082225,1159629,"Res. S.R.T. 15/2022"]
[null,null,"2022-03-17",6123338,2721484,3401855,4082225,1159629,"Res. S.R.T. 15/2022"]
[null,null,"2022-03-18",6123338,2721484,3401855,4082225,1159629,"Res. S.R.T. 15/2022"]
[null,null,"2022-03-19",6123338,2721484,3401855,4082225,1159629,"Res. S.R.T. 15/2022"]
[null,null,"2022-03-20",6123338,2721484,3401855,4082225,1159629,"Res. S.R.T. 15/2022"]
[null,null,"2022-03-21",6123338,2721484,3401855,4082225,1159629,"Res. S.R.T. 15/2022"]
[null,null,"2022-03-22",6123338,2721484,3401855,4082225,1159629,"Res. S.R.T. 15/2022"]
[null,null,"2022-03-23",6123338,2721484,3401855,4082225,1159629,"Res. S.R.T. 15/2022"]
[null,null,"2022-03-24",6123338,2721484,3401855,4082225,1159629,"Res. S.R.T. 15/2022"]
[null,null,"2022-03-25",6123338,2721484,3401855,4082225,1159629,"Res. S.R.T. 15/2022"]
[null,null,"2022-03-26",6123338,2721484,3401855,4082225,1159629,"Res. S.R.T. 15/2022"]
[null,null,"2022-03-27",6123338,2721484,3401855,4082225,1159629,"Res. S.R.T. 15/2022"]
[null,null,"2022-03-28",6123338,2721484,3401855,4082225,1159629,"Res. S.R.T. 15/2022"]
[null,null,"2022-03-29",6123338,2721484,3401855,4082225,1159629,"Res. S.R.T. 15/2022"]
[null,null,"2022-03-30",6123338,2721484,3401855,4082225,1159629,"Res. S.R.T. 15/2022"]
[null,null,"2022-03-31",6123338,2721484,3401855,4082225,1159629,"Res. S.R.T. 15/2022"]
[null,null,"2022-04-01",6123338,2721484,3401855,4082225,1159629,"Res. S.R.T. 15/2022"]
[null,null,"2022-04-02",6123338,2721484,3401855,4082225,1159629,"Res. S.R.T. 15/2022"]
[null,null,"2022-04-03",6123338,2721484,3401855,4082225,1159629,"Res. S.R.T. 15/2022"]
[null,null,"2022-04-04",6123338,2721484,3401855,4082225,1159629,"Res. S.R.T. 15/2022"]
[null,null,"2022-04-05",6123338,2721484,3401855,4082225,1159629,"Res. S.R.T. 15/2022"]
[null,null,"2022-04-06",6123338,2721484,3401855,4082225,1159629,"Res. S.R.T. 15/2022"]
[null,null,"2022-04-07",6123338,2721484,3401855,4082225,1159629,"Res. S.R.T. 15/2022"]
[null,null,"2022-04-08",6123338,2721484,3401855,4082225,1159629,"Res. S.R.T. 15/2022"]
[null,null,"2022-04-09",6123338,2721484,3401855,4082225,1159629,"Res. S.R.T. 15/2022"]
[null,null,"2022-04-10",6123338,2721484,3401855,4082225,1159629,"Res. S.R.T. 15/2022"]
[null,null,"2022-04-11",6123338,2721484,3401855,4082225,1159629,"Res. S.R.T. 15/2022"]
[null,null,"2022-04-12",6123338,2721484,3401855,4082225,1159629,"Res. S.R.T. 15/2022"]
[null,null,"2022-04-13",6123338,2721484,3401855,4082225,1159629,"Res. S.R.T. 15/2022"]
[null,null,"2022-04-14",6123338,2721484,3401855,4082225,1159629,"Res. S.R.T. 15/2022"]
[null,null,"2022-04-15",6123338,2721484,3401855,4082225,1159629,"Res. S.R.T. 15/2022"]
[null,null,"2022-04-16",6123338,2721484,3401855,4082225,1159629,"Res. S.R.T. 15/2022"]
[null,null,"2022-04-17",6123338,2721484,3401855,4082225,1159629,"Res. S.R.T. 15/2022"]
[null,null,"2022-04-18",6123338,2721484,3401855,4082225,1159629,"Res. S.R.T. 15/2022"]
[null,null,"2022-04-19",6123338,2721484,3401855,4082225,1159629,"Res. S.R.T. 15/2022"]
[null,null,"2022-04-20",6123338,2721484,3401855,4082225,1159629,"Res. S.R.T. 15/2022"]
[null,null,"2022-04-21",6123338,2721484,3401855,4082225,1159629,"Res. S.R.T. 15/2022"]
[null,null,"2022-04-22",6123338,2721484,3401855,4082225,1159629,"Res. S.R.T. 15/2022"]
[null,null,"2022-04-23",6123338,2721484,3401855,4082225,1159629,"Res. S.R.T. 15/2022"]
[null,null,"2022-04-24",6123338,2721484,3401855,4082225,1159629,"Res. S.R.T. 15/2022"]
[null,null,"2022-04-25",6123338,2721484,3401855,4082225,1159629,"Res. S.R.T. 15/2022"]
[null,null,"2022-04-26",6123338,2721484,3401855,4082225,1159629,"Res. S.R.T. 15/2022"]
[null,null,"2022-04-27",6123338,2721484,3401855,4082225,1159629,"Res. S.R.T. 15/2022"]
[null,null,"2022-04-28",6123338,2721484,3401855,4082225,1159629,"Res. S.R.T. 15/2022"]
[null,null,"2022-04-29",6123338,2721484,3401855,4082225,1159629,"Res. S.R.T. 15/2022"]
[null,null,"2022-04-30",6123338,2721484,3401855,4082225,1159629,"Res. S.R.T. 15/2022"]
[null,null,"2022-05-01",6123338,2721484,3401855,4082225,1159629,"Res. S.R.T. 15/2022"]
[null,null,"2022-05-02",6123338,2721484,3401855,4082225,1159629,"Res. S.R.T. 15/2022"]
[null,null,"2022-05-03",6123338,2721484,3401855,4082225,1159629,"Res. S.R.T. 15/2022"]
[null,null,"2022-05-04",6123338,2721484,3401855,4082225,1159629,"Res. S.R.T. 15/2022"]
[null,null,"2022-05-05",6123338,2721484,3401855,4082225,1159629,"Res. S.R.T. 15/2022"]
[null,null,"2022-05-06",6123338,2721484,3401855,4082225,1159629,"Res. S.R.T. 15/2022"]
[null,null,"2022-05-07",6123338,2721484,3401855,4082225,1159629,"Res. S.R.T. 15/2022"]
[null,null,"2022-05-08",6123338,2721484,3401855,4082225,1159629,"Res. S.R.T. 15/2022"]
[null,null,"2022-05-09",6123338,2721484,3401855,4082225,1159629,"Res. S.R.T. 15/2022"]
[null,null,"2022-05-10",6123338,2721484,3401855,4082225,1159629,"Res. S.R.T. 15/2022"]
[null,null,"2022-05-11",6123338,2721484,3401855,4082225,1159629,"Res. S.R.T. 15/2022"]
[null,null,"2022-05-12",6123338,2721484,3401855,4082225,1159629,"Res. S.R.T. 15/2022"]
[null,null,"2022-05-13",6123338,2721484,3401855,4082225,1159629,"Res. S.R.T. 15/2022"]
[null,null,"2022-05-14",6123338,2721484,3401855,4082225,1159629,"Res. S.R.T. 15/2022"]
[null,null,"2022-05-15",6123338,2721484,3401855,4082225,1159629,"Res. S.R.T. 15/2022"]
[null,null,"2022-05-16",6123338,2721484,3401855,4082225,1159629,"Res. S.R.T. 15/2022"]
[null,null,"2022-05-17",6123338,2721484,3401855,4082225,1159629,"Res. S.R.T. 15/2022"]
[null,null,"2022-05-18",6123338,2721484,3401855,4082225,1159629,"Res. S.R.T. 15/2022"]
[null,null,"2022-05-19",6123338,2721484,3401855,4082225,1159629,"Res. S.R.T. 15/2022"]
[null,null,"2022-05-20",6123338,2721484,3401855,4082225,1159629,"Res. S.R.T. 15/2022"]
[null,null,"2022-05-21",6123338,2721484,3401855,4082225,1159629,"Res. S.R.T. 15/2022"]
[null,null,"2022-05-22",6123338,2721484,3401855,4082225,1159629,"Res. S.R.T. 15/2022"]
[null,null,"2022-05-23",6123338,2721484,3401855,4082225,1159629,"Res. S.R.T. 15/2022"]
[null,null,"2022-05-24",6123338,2721484,3401855,4082225,1159629,"Res. S.R.T. 15/2022"]
[null,null,"2022-05-25",6123338,2721484,3401855,4082225,1159629,"Res. S.R.T. 15/2022"]
[null,null,"2022-05-26",6123338,2721484,3401855,4082225,1159629,"Res. S.R.T. 15/2022"]
[null,null,"2022-05-27",6123338,2721484,3401855,4082225,1159629,"Res. S.R.T. 15/2022"]
[null,null,"2022-05-28",6123338,2721484,3401855,4082225,1159629,"Res. S.R.T. 15/2022"]
[null,null,"2022-05-29",6123338,2721484,3401855,4082225,1159629,"Res. S.R.T. 15/2022"]
[null,null,"2022-05-30",6123338,2721484,3401855,4082225,1159629,"Res. S.R.T. 15/2022"]
[null,null,"2022-05-31",6123338,2721484,3401855,4082225,1159629,"Res. S.R.T. 15/2022"]
[null,null,"2022-06-01",6123338,2721484,3401855,4082225,1159629,"Res. S.R.T. 15/2022"]
[null,null,"2022-06-02",6123338,2721484,3401855,4082225,1159629,"Res. S.R.T. 15/2022"]
[null,null,"2022-06-03",6123338,2721484,3401855,4082225,1159629,"Res. S.R.T. 15/2022"]
[null,null,"2022-06-04",6123338,2721484,3401855,4082225,1159629,"Res. S.R.T. 15/2022"]
[null,null,"2022-06-05",6123338,2721484,3401855,4082225,1159629,"Res. S.R.T. 15/2022"]
[null,null,"2022-06-06",6123338,2721484,3401855,4082225,1159629,"Res. S.R.T. 15/2022"]
[null,null,"2022-06-07",6123338,2721484,3401855,4082225,1159629,"Res. S.R.T. 15/2022"]
[null,null,"2022-06-08",6123338,2721484,3401855,4082225,1159629,"Res. S.R.T. 15/2022"]
[null,null,"2022-06-09",6123338,2721484,3401855,4082225,1159629,"Res. S.R.T. 15/2022"]
[null,null,"2022-06-10",6123338,2721484,3401855,4082225,1159629,"Res. S.R.T. 15/2022"]
[null,null,"2022-06-11",6123338,2721484,3401855,4082225,1159629,"Res. S.R.T. 15/2022"]
[null,null,"2022-06-12",6123338,2721484,3401855,4082225,1159629,"Res. S.R.T. 15/2022"]
[null,null,"2022-06-13",6123338,2721484,3401855,4082225,1159629,"Res. S.R.T. 15/2022"]
[null,null,"2022-06-14",6123338,2721484,3401855,4082225,1159629,"Res. S.R.T. 15/2022"]
[null,null,"2022-06-15",6123338,2721484,3401855,4082225,1159629,"Res. S.R.T. 15/2022"]
[null,null,"2022-06-16",6123338,2721484,3401855,4082225,1159629,"Res. S.R.T. 15/2022"]
[null,null,"2022-06-17",6123338,2721484,3401855,4082225,1159629,"Res. S.R.T. 15/2022"]
[null,null,"2022-06-18",6123338,2721484,3401855,4082225,1159629,"Res. S.R.T. 15/2022"]
[null,null,"2022-06-19",6123338,2721484,3401855,4082225,1159629,"Res. S.R.T. 15/2022"]
[null,null,"2022-06-20",6123338,2721484,3401855,4082225,1159629,"Res. S.R.T. 15/2022"]
[null,null,"2022-06-21",6123338,2721484,3401855,4082225,1159629,"Res. S.R.T. 15/2022"]
[null,null,"2022-06-22",6123338,2721484,3401855,4082225,1159629,"Res. S.R.T. 15/2022"]
[null,null,"2022-06-23",6123338,2721484,3401855,4082225,1159629,"Res. S.R.T. 15/2022"]
[null,null,"2022-06-24",6123338,2721484,3401855,4082225,1159629,"Res. S.R.T. 15/2022"]
[null,null,"2022-06-25",6123338,2721484,3401855,4082225,1159629,"Res. S.R.T. 15/2022"]
[null,null,"2022-06-26",6123338,2721484,3401855,4082225,1159629,"Res. S.R.T. 15/2022"]
[null,null,"2022-06-27",6123338,2721484,3401855,4082225,1159629,"Res. S.R.T. 15/2022"]
[null,null,"2022-06-28",6123338,2721484,3401855,4082225,1159629,"Res. S.R.T. 15/2022"]
[null,null,"2022-06-29",6123338,2721484,3401855,4082225,1159629,"Res. S.R.T. 15/2022"]
[null,null,"2022-06-30",6123338,2721484,3401855,4082225,1159629,"Res. S.R.T. 15/2022"]
[null,null,"2022-07-01",6123338,2721484,3401855,4082225,1159629,"Res. S.R.T. 15/2022"]
[null,null,"2022-07-02",6123338,2721484,3401855,4082225,1159629,"Res. S.R.T. 15/2022"]
[null,null,"2022-07-03",6123338,2721484,3401855,4082225,1159629,"Res. S.R.T. 15/2022"]
[null,null,"2022-07-04",6123338,2721484,3401855,4082225,1159629,"Res. S.R.T. 15/2022"]
[null,null,"2022-07-05",6123338,2721484,3401855,4082225,1159629,"Res. S.R.T. 15/2022"]
[null,null,"2022-07-06",6123338,2721484,3401855,4082225,1159629,"Res. S.R.T. 15/2022"]
[null,null,"2022-07-07",6123338,2721484,3401855,4082225,1159629,"Res. S.R.T. 15/2022"]
[null,null,"2022-07-08",6123338,2721484,3401855,4082225,1159629,"Res. S.R.T. 15/2022"]
[null,null,"2022-07-09",6123338,2721484,3401855,4082225,1159629,"Res. S.R.T. 15/2022"]
[null,null,"2022-07-10",6123338,2721484,3401855,4082225,1159629,"Res. S.R.T. 15/2022"]
[null,null,"2022-07-11",6123338,2721484,3401855,4082225,1159629,"Res. S.R.T. 15/2022"]
[null,null,"2022-07-12",6123338,2721484,3401855,4082225,1159629,"Res. S.R.T. 15/2022"]
[null,null,"2022-07-13",6123338,2721484,3401855,4082225,1159629,"Res. S.R.T. 15/2022"]
[null,null,"2022-07-14",6123338,2721484,3401855,4082225,1159629,"Res. S.R.T. 15/2022"]
[null,null,"2022-07-15",6123338,2721484,3401855,4082225,1159629,"Res. S.R.T. 15/2022"]
[null,null,"2022-07-16",6123338,2721484,3401855,4082225,1159629,"Res. S.R.T. 15/2022"]
[null,null,"2022-07-17",6123338,2721484,3401855,4082225,1159629,"Res. S.R.T. 15/2022"]
[null,null,"2022-07-18",6123338,2721484,3401855,4082225,1159629,"Res. S.R.T. 15/2022"]
[null,null,"2022-07-19",6123338,2721484,3401855,4082225,1159629,"Res. S.R.T. 15/2022"]
[null,null,"2022-07-20",6123338,2721484,3401855,4082225,1159629,"Res. S.R.T. 15/2022"]
[null,null,"2022-07-21",6123338,2721484,3401855,4082225,1159629,"Res. S.R.T. 15/2022"]
[null,null,"2022-07-22",6123338,2721484,3401855,4082225,1159629,"Res. S.R.T. 15/2022"]
[null,null,"2022-07-23",6123338,2721484,3401855,4082225,1159629,"Res. S.R.T. 15/2022"]
[null,null,"2022-07-24",6123338,2721484,3401855,4082225,1159629,"Res. S.R.T. 15/2022"]
[null,null,"2022-07-25",6123338,2721484,3401855,4082225,1159629,"Res. S.R.T. 15/2022"]
[null,null,"2022-07-26",6123338,2721484,3401855,4082225,1159629,"Res. S.R.T. 15/2022"]
[null,null,"2022-07-27",6123338,2721484,3401855,4082225,1159629,"Res. S.R.T. 15/2022"]
[null,null,"2022-07-28",6123338,2721484,3401855,4082225,1159629,"Res. S.R.T. 15/2022"]
[null,null,"2022-07-29",6123338,2721484,3401855,4082225,1159629,"Res. S.R.T. 15/2022"]
[null,null,"2022-07-30",6123338,2721484,3401855,4082225,1159629,"Res. S.R.T. 15/2022"]
[null,null,"2022-07-31",6123338,2721484,3401855,4082225,1159629,"Res. S.R.T. 15/2022"]
[null,null,"2022-08-01",6123338,2721484,3401855,4082225,1159629,"Res. S.R.T. 15/2022"]
[null,null,"2022-08-02",6123338,2721484,3401855,4082225,1159629,"Res. S.R.T. 15/2022"]
[null,null,"2022-08-03",6123338,2721484,3401855,4082225,1159629,"Res. S.R.T. 15/2022"]
[null,null,"2022-08-04",6123338,2721484,3401855,4082225,1159629,"Res. S.R.T. 15/2022"]
[null,null,"2022-08-05",6123338,2721484,3401855,4082225,1159629,"Res. S.R.T. 15/2022"]
[null,null,"2022-08-06",6123338,2721484,3401855,4082225,1159629,"Res. S.R.T. 15/2022"]
[null,null,"2022-08-07",6123338,2721484,3401855,4082225,1159629,"Res. S.R.T. 15/2022"]
[null,null,"2022-08-08",6123338,2721484,3401855,4082225,1159629,"Res. S.R.T. 15/2022"]
[null,null,"2022-08-09",6123338,2721484,3401855,4082225,1159629,"Res. S.R.T. 15/2022"]
[null,null,"2022-08-10",6123338,2721484,3401855,4082225,1159629,"Res. S.R.T. 15/2022"]
[null,null,"2022-08-11",6123338,2721484,3401855,4082225,1159629,"Res. S.R.T. 15/2022"]
[null,null,"2022-08-12",6123338,2721484,3401855,4082225,1159629,"Res. S.R.T. 15/2022"]
[null,null,"2022-08-13",6123338,2721484,3401855,4082225,1159629,"Res. S.R.T. 15/2022"]
[null,null,"2022-08-14",6123338,2721484,3401855,4082225,1159629,"Res. S.R.T. 15/2022"]
[null,null,"2022-08-15",6123338,2721484,3401855,4082225,1159629,"Res. S.R.T. 15/2022"]
[null,null,"2022-08-16",6123338,2721484,3401855,4082225,1159629,"Res. S.R.T. 15/2022"]
[null,null,"2022-08-17",6123338,2721484,3401855,4082225,1159629,"Res. S.R.T. 15/2022"]
[null,null,"2022-08-18",6123338,2721484,3401855,4082225,1159629,"Res. S.R.T. 15/2022"]
[null,null,"2022-08-19",6123338,2721484,3401855,4082225,1159629,"Res. S.R.T. 15/2022"]
[null,null,"2022-08-20",6123338,2721484,3401855,4082225,1159629,"Res. S.R.T. 15/2022"]
[null,null,"2022-08-21",6123338,2721484,3401855,4082225,1159629,"Res. S.R.T. 15/2022"]
[null,null,"2022-08-22",6123338,2721484,3401855,4082225,1159629,"Res. S.R.T. 15/2022"]
[null,null,"2022-08-23",6123338,2721484,3401855,4082225,1159629,"Res. S.R.T. 15/2022"]
[null,null,"2022-08-24",6123338,2721484,3401855,4082225,1159629,"Res. S.R.T. 15/2022"]
[null,null,"2022-08-25",6123338,2721484,3401855,4082225,1159629,"Res. S.R.T. 15/2022"]
[null,null,"2022-08-26",6123338,2721484,3401855,4082225,1159629,"Res. S.R.T. 15/2022"]
[null,null,"2022-08-27",6123338,2721484,3401855,4082225,1159629,"Res. S.R.T. 15/2022"]
[null,null,"2022-08-28",6123338,2721484,3401855,4082225,1159629,"Res. S.R.T. 15/2022"]
[null,null,"2022-08-29",6123338,2721484,3401855,4082225,1159629,"Res. S.R.T. 15/2022"]
[null,null,"2022-08-30",6123338,2721484,3401855,4082225,1159629,"Res. S.R.T. 15/2022"]
[null,null,"2022-08-31",6123338,2721484,3401855,4082225,1159629,"Res. S.R.T. 15/2022"]
[null,null,"2022-09-01",8433218,3748097,4685122,5622145,1597071,"Res. S.R.T. 51/2022"]
[null,null,"2022-09-02",8433218,3748097,4685122,5622145,1597071,"Res. S.R.T. 51/2022"]
[null,null,"2022-09-03",8433218,3748097,4685122,5622145,1597071,"Res. S.R.T. 51/2022"]
[null,null,"2022-09-04",8433218,3748097,4685122,5622145,1597071,"Res. S.R.T. 51/2022"]
[null,null,"2022-09-05",8433218,3748097,4685122,5622145,1597071,"Res. S.R.T. 51/2022"]
[null,null,"2022-09-06",8433218,3748097,4685122,5622145,1597071,"Res. S.R.T. 51/2022"]
[null,null,"2022-09-07",8433218,3748097,4685122,5622145,1597071,"Res. S.R.T. 51/2022"]
[null,null,"2022-09-08",8433218,3748097,4685122,5622145,1597071,"Res. S.R.T. 51/2022"]
[null,null,"2022-09-09",8433218,3748097,4685122,5622145,1597071,"Res. S.R.T. 51/2022"]
[null,null,"2022-09-10",8433218,3748097,4685122,5622145,1597071,"Res. S.R.T. 51/2022"]
[null,null,"2022-09-11",8433218,3748097,4685122,5622145,1597071,"Res. S.R.T. 51/2022"]
[null,null,"2022-09-12",8433218,3748097,4685122,5622145,1597071,"Res. S.R.T. 51/2022"]
[null,null,"2022-09-13",8433218,3748097,4685122,5622145,1597071,"Res. S.R.T. 51/2022"]
[null,null,"2022-09-14",8433218,3748097,4685122,5622145,1597071,"Res. S.R.T. 51/2022"]
[null,null,"2022-09-15",8433218,3748097,4685122,5622145,1597071,"Res. S.R.T. 51/2022"]
[null,null,"2022-09-16",8433218,3748097,4685122,5622145,1597071,"Res. S.R.T. 51/2022"]
[null,null,"2022-09-17",8433218,3748097,4685122,5622145,1597071,"Res. S.R.T. 51/2022"]
[null,null,"2022-09-18",8433218,3748097,4685122,5622145,1597071,"Res. S.R.T. 51/2022"]
[null,null,"2022-09-19",8433218,3748097,4685122,5622145,1597071,"Res. S.R.T. 51/2022"]
[null,null,"2022-09-20",8433218,3748097,4685122,5622145,1597071,"Res. S.R.T. 51/2022"]
[null,null,"2022-09-21",8433218,3748097,4685122,5622145,1597071,"Res. S.R.T. 51/2022"]
[null,null,"2022-09-22",8433218,3748097,4685122,5622145,1597071,"Res. S.R.T. 51/2022"]
[null,null,"2022-09-23",8433218,3748097,4685122,5622145,1597071,"Res. S.R.T. 51/2022"]
[null,null,"2022-09-24",8433218,3748097,4685122,5622145,1597071,"Res. S.R.T. 51/2022"]
[null,null,"2022-09-25",8433218,3748097,4685122,5622145,1597071,"Res. S.R.T. 51/2022"]
[null,null,"2022-09-26",8433218,3748097,4685122,5622145,1597071,"Res. S.R.T. 51/2022"]
[null,null,"2022-09-27",8433218,3748097,4685122,5622145,1597071,"Res. S.R.T. 51/2022"]
[null,null,"2022-09-28",8433218,3748097,4685122,5622145,1597071,"Res. S.R.T. 51/2022"]
[null,null,"2022-09-29",8433218,3748097,4685122,5622145,1597071,"Res. S.R.T. 51/2022"]
[null,null,"2022-09-30",8433218,3748097,4685122,5622145,1597071,"Res. S.R.T. 51/2022"]
[null,null,"2022-10-01",8433218,3748097,4685122,5622145,1597071,"Res. S.R.T. 51/2022"]
[null,null,"2022-10-02",8433218,3748097,4685122,5622145,1597071,"Res. S.R.T. 51/2022"]
[null,null,"2022-10-03",8433218,3748097,4685122,5622145,1597071,"Res. S.R.T. 51/2022"]
[null,null,"2022-10-04",8433218,3748097,4685122,5622145,1597071,"Res. S.R.T. 51/2022"]
[null,null,"2022-10-05",8433218,3748097,4685122,5622145,1597071,"Res. S.R.T. 51/2022"]
[null,null,"2022-10-06",8433218,3748097,4685122,5622145,1597071,"Res. S.R.T. 51/2022"]
[null,null,"2022-10-07",8433218,3748097,4685122,5622145,1597071,"Res. S.R.T. 51/2022"]
[null,null,"2022-10-08",8433218,3748097,4685122,5622145,1597071,"Res. S.R.T. 51/2022"]
[null,null,"2022-10-09",8433218,3748097,4685122,5622145,1597071,"Res. S.R.T. 51/2022"]
[null,null,"2022-10-10",8433218,3748097,4685122,5622145,1597071,"Res. S.R.T. 51/2022"]
[null,null,"2022-10-11",8433218,3748097,4685122,5622145,1597071,"Res. S.R.T. 51/2022"]
[null,null,"2022-10-12",8433218,3748097,4685122,5622145,1597071,"Res. S.R.T. 51/2022"]
[null,null,"2022-10-13",8433218,3748097,4685122,5622145,1597071,"Res. S.R.T. 51/2022"]
[null,null,"2022-10-14",8433218,3748097,4685122,5622145,1597071,"Res. S.R.T. 51/2022"]
[null,null,"2022-10-15",8433218,3748097,4685122,5622145,1597071,"Res. S.R.T. 51/2022"]
[null,null,"2022-10-16",8433218,3748097,4685122,5622145,1597071,"Res. S.R.T. 51/2022"]
[null,null,"2022-10-17",8433218,3748097,4685122,5622145,1597071,"Res. S.R.T. 51/2022"]
[null,null,"2022-10-18",8433218,3748097,4685122,5622145,1597071,"Res. S.R.T. 51/2022"]
[null,null,"2022-10-19",8433218,3748097,4685122,5622145,1597071,"Res. S.R.T. 51/2022"]
[null,null,"2022-10-20",8433218,3748097,4685122,5622145,1597071,"Res. S.R.T. 51/2022"]
[null,null,"2022-10-21",8433218,3748097,4685122,5622145,1597071,"Res. S.R.T. 51/2022"]
[null,null,"2022-10-22",8433218,3748097,4685122,5622145,1597071,"Res. S.R.T. 51/2022"]
[null,null,"2022-10-23",8433218,3748097,4685122,5622145,1597071,"Res. S.R.T. 51/2022"]
[null,null,"2022-10-24",8433218,3748097,4685122,5622145,1597071,"Res. S.R.T. 51/2022"]
[null,null,"2022-10-25",8433218,3748097,4685122,5622145,1597071,"Res. S.R.T. 51/2022"]
[null,null,"2022-10-26",8433218,3748097,4685122,5622145,1597071,"Res. S.R.T. 51/2022"]
[null,null,"2022-10-27",8433218,3748097,4685122,5622145,1597071,"Res. S.R.T. 51/2022"]
[null,null,"2022-10-28",8433218,3748097,4685122,5622145,1597071,"Res. S.R.T. 51/2022"]
[null,null,"2022-10-29",8433218,3748097,4685122,5622145,1597071,"Res. S.R.T. 51/2022"]
[null,null,"2022-10-30",8433218,3748097,4685122,5622145,1597071,"Res. S.R.T. 51/2022"]
[null,null,"2022-10-31",8433218,3748097,4685122,5622145,1597071,"Res. S.R.T. 51/2022"]
[null,null,"2022-11-01",8433218,3748097,4685122,5622145,1597071,"Res. S.R.T. 51/2022"]
[null,null,"2022-11-02",8433218,3748097,4685122,5622145,1597071,"Res. S.R.T. 51/2022"]
[null,null,"2022-11-03",8433218,3748097,4685122,5622145,1597071,"Res. S.R.T. 51/2022"]
[null,null,"2022-11-04",8433218,3748097,4685122,5622145,1597071,"Res. S.R.T. 51/2022"]
[null,null,"2022-11-05",8433218,3748097,4685122,5622145,1597071,"Res. S.R.T. 51/2022"]
[null,null,"2022-11-06",8433218,3748097,4685122,5622145,1597071,"Res. S.R.T. 51/2022"]
[null,null,"2022-11-07",8433218,3748097,4685122,5622145,1597071,"Res. S.R.T. 51/2022"]
[null,null,"2022-11-08",8433218,3748097,4685122,5622145,1597071,"Res. S.R.T. 51/2022"]
[null,null,"2022-11-09",8433218,3748097,4685122,5622145,1597071,"Res. S.R.T. 51/2022"]
[null,null,"2022-11-10",8433218,3748097,4685122,5622145,1597071,"Res. S.R.T. 51/2022"]
[null,null,"2022-11-11",8433218,3748097,4685122,5622145,1597071,"Res. S.R.T. 51/2022"]
[null,null,"2022-11-12",8433218,3748097,4685122,5622145,1597071,"Res. S.R.T. 51/2022"]
[null,null,"2022-11-13",8433218,3748097,4685122,5622145,1597071,"Res. S.R.T. 51/2022"]
[null,null,"2022-11-14",8433218,3748097,4685122,5622145,1597071,"Res. S.R.T. 51/2022"]
[null,null,"2022-11-15",8433218,3748097,4685122,5622145,1597071,"Res. S.R.T. 51/2022"]
[null,null,"2022-11-16",8433218,3748097,4685122,5622145,1597071,"Res. S.R.T. 51/2022"]
[null,null,"2022-11-17",8433218,3748097,4685122,5622145,1597071,"Res. S.R.T. 51/2022"]
[null,null,"2022-11-18",8433218,3748097,4685122,5622145,1597071,"Res. S.R.T. 51/2022"]
[null,null,"2022-11-19",8433218,3748097,4685122,5622145,1597071,"Res. S.R.T. 51/2022"]
[null,null,"2022-11-20",8433218,3748097,4685122,5622145,1597071,"Res. S.R.T. 51/2022"]
[null,null,"2022-11-21",8433218,3748097,4685122,5622145,1597071,"Res. S.R.T. 51/2022"]
[null,null,"2022-11-22",8433218,3748097,4685122,5622145,1597071,"Res. S.R.T. 51/2022"]
[null,null,"2022-11-23",8433218,3748097,4685122,5622145,1597071,"Res. S.R.T. 51/2022"]
[null,null,"2022-11-24",8433218,3748097,4685122,5622145,1597071,"Res. S.R.T. 51/2022"]
[null,null,"2022-11-25",8433218,3748097,4685122,5622145,1597071,"Res. S.R.T. 51/2022"]
[null,null,"2022-11-26",8433218,3748097,4685122,5622145,1597071,"Res. S.R.T. 51/2022"]
[null,null,"2022-11-27",8433218,3748097,4685122,5622145,1597071,"Res. S.R.T. 51/2022"]
[null,null,"2022-11-28",8433218,3748097,4685122,5622145,1597071,"Res. S.R.T. 51/2022"]
[null,null,"2022-11-29",8433218,3748097,4685122,5622145,1597071,"Res. S.R.T. 51/2022"]
[null,null,"2022-11-30",8433218,3748097,4685122,5622145,1597071,"Res. S.R.T. 51/2022"]
[null,null,"2022-12-01",8433218,3748097,4685122,5622145,1597071,"Res. S.R.T. 51/2022"]
[null,null,"2022-12-02",8433218,3748097,4685122,5622145,1597071,"Res. S.R.T. 51/2022"]
[null,null,"2022-12-03",8433218,3748097,4685122,5622145,1597071,"Res. S.R.T. 51/2022"]
[null,null,"2022-12-04",8433218,3748097,4685122,5622145,1597071,"Res. S.R.T. 51/2022"]
[null,null,"2022-12-05",8433218,3748097,4685122,5622145,1597071,"Res. S.R.T. 51/2022"]
[null,null,"2022-12-06",8433218,3748097,4685122,5622145,1597071,"Res. S.R.T. 51/2022"]
[null,null,"2022-12-07",8433218,3748097,4685122,5622145,1597071,"Res. S.R.T. 51/2022"]
[null,null,"2022-12-08",8433218,3748097,4685122,5622145,1597071,"Res. S.R.T. 51/2022"]
[null,null,"2022-12-09",8433218,3748097,4685122,5622145,1597071,"Res. S.R.T. 51/2022"]
[null,null,"2022-12-10",8433218,3748097,4685122,5622145,1597071,"Res. S.R.T. 51/2022"]
[null,null,"2022-12-11",8433218,3748097,4685122,5622145,1597071,"Res. S.R.T. 51/2022"]
[null,null,"2022-12-12",8433218,3748097,4685122,5622145,1597071,"Res. S.R.T. 51/2022"]
[null,null,"2022-12-13",8433218,3748097,4685122,5622145,1597071,"Res. S.R.T. 51/2022"]
[null,null,"2022-12-14",8433218,3748097,4685122,5622145,1597071,"Res. S.R.T. 51/2022"]
[null,null,"2022-12-15",8433218,3748097,4685122,5622145,1597071,"Res. S.R.T. 51/2022"]
[null,null,"2022-12-16",8433218,3748097,4685122,5622145,1597071,"Res. S.R.T. 51/2022"]
[null,null,"2022-12-17",8433218,3748097,4685122,5622145,1597071,"Res. S.R.T. 51/2022"]
[null,null,"2022-12-18",8433218,3748097,4685122,5622145,1597071,"Res. S.R.T. 51/2022"]
[null,null,"2022-12-19",8433218,3748097,4685122,5622145,1597071,"Res. S.R.T. 51/2022"]
[null,null,"2022-12-20",8433218,3748097,4685122,5622145,1597071,"Res. S.R.T. 51/2022"]
[null,null,"2022-12-21",8433218,3748097,4685122,5622145,1597071,"Res. S.R.T. 51/2022"]
[null,null,"2022-12-22",8433218,3748097,4685122,5622145,1597071,"Res. S.R.T. 51/2022"]
[null,null,"2022-12-23",8433218,3748097,4685122,5622145,1597071,"Res. S.R.T. 51/2022"]
[null,null,"2022-12-24",8433218,3748097,4685122,5622145,1597071,"Res. S.R.T. 51/2022"]
[null,null,"2022-12-25",8433218,3748097,4685122,5622145,1597071,"Res. S.R.T. 51/2022"]
[null,null,"2022-12-26",8433218,3748097,4685122,5622145,1597071,"Res. S.R.T. 51/2022"]
[null,null,"2022-12-27",8433218,3748097,4685122,5622145,1597071,"Res. S.R.T. 51/2022"]
[null,null,"2022-12-28",8433218,3748097,4685122,5622145,1597071,"Res. S.R.T. 51/2022"]
[null,null,"2022-12-29",8433218,3748097,4685122,5622145,1597071,"Res. S.R.T. 51/2022"]
[null,null,"2022-12-30",8433218,3748097,4685122,5622145,1597071,"Res. S.R.T. 51/2022"]
[null,null,"2022-12-31",8433218,3748097,4685122,5622145,1597071,"Res. S.R.T. 51/2022"]
[null,null,"2023-01-01",8433218,3748097,4685122,5622145,1597071,"Res. S.R.T. 51/2022"]
[null,null,"2023-01-02",8433218,3748097,4685122,5622145,1597071,"Res. S.R.T. 51/2022"]
[null,null,"2023-01-03",8433218,3748097,4685122,5622145,1597071,"Res. S.R.T. 51/2022"]
[null,null,"2023-01-04",8433218,3748097,4685122,5622145,1597071,"Res. S.R.T. 51/2022"]
[null,null,"2023-01-05",8433218,3748097,4685122,5622145,1597071,"Res. S.R.T. 51/2022"]
[null,null,"2023-01-06",8433218,3748097,4685122,5622145,1597071,"Res. S.R.T. 51/2022"]
[null,null,"2023-01-07",8433218,3748097,4685122,5622145,1597071,"Res. S.R.T. 51/2022"]
[null,null,"2023-01-08",8433218,3748097,4685122,5622145,1597071,"Res. S.R.T. 51/2022"]
[null,null,"2023-01-09",8433218,3748097,4685122,5622145,1597071,"Res. S.R.T. 51/2022"]
[null,null,"2023-01-10",8433218,3748097,4685122,5622145,1597071,"Res. S.R.T. 51/2022"]
[null,null,"2023-01-11",8433218,3748097,4685122,5622145,1597071,"Res. S.R.T. 51/2022"]
[null,null,"2023-01-12",8433218,3748097,4685122,5622145,1597071,"Res. S.R.T. 51/2022"]
[null,null,"2023-01-13",8433218,3748097,4685122,5622145,1597071,"Res. S.R.T. 51/2022"]
[null,null,"2023-01-14",8433218,3748097,4685122,5622145,1597071,"Res. S.R.T. 51/2022"]
[null,null,"2023-01-15",8433218,3748097,4685122,5622145,1597071,"Res. S.R.T. 51/2022"]
[null,null,"2023-01-16",8433218,3748097,4685122,5622145,1597071,"Res. S.R.T. 51/2022"]
[null,null,"2023-01-17",8433218,3748097,4685122,5622145,1597071,"Res. S.R.T. 51/2022"]
[null,null,"2023-01-18",8433218,3748097,4685122,5622145,1597071,"Res. S.R.T. 51/2022"]
[null,null,"2023-01-19",8433218,3748097,4685122,5622145,1597071,"Res. S.R.T. 51/2022"]
[null,null,"2023-01-20",8433218,3748097,4685122,5622145,1597071,"Res. S.R.T. 51/2022"]
[null,null,"2023-01-21",8433218,3748097,4685122,5622145,1597071,"Res. S.R.T. 51/2022"]
[null,null,"2023-01-22",8433218,3748097,4685122,5622145,1597071,"Res. S.R.T. 51/2022"]
[null,null,"2023-01-23",8433218,3748097,4685122,5622145,1597071,"Res. S.R.T. 51/2022"]
[null,null,"2023-01-24",8433218,3748097,4685122,5622145,1597071,"Res. S.R.T. 51/2022"]
[null,null,"2023-01-25",8433218,3748097,4685122,5622145,1597071,"Res. S.R.T. 51/2022"]
[null,null,"2023-01-26",8433218,3748097,4685122,5622145,1597071,"Res. S.R.T. 51/2022"]
[null,null,"2023-01-27",8433218,3748097,4685122,5622145,1597071,"Res. S.R.T. 51/2022"]
[null,null,"2023-01-28",8433218,3748097,4685122,5622145,1597071,"Res. S.R.T. 51/2022"]
[null,null,"2023-01-29",8433218,3748097,4685122,5622145,1597071,"Res. S.R.T. 51/2022"]
[null,null,"2023-01-30",8433218,3748097,4685122,5622145,1597071,"Res. S.R.T. 51/2022"]
[null,null,"2023-01-31",8433218,3748097,4685122,5622145,1597071,"Res. S.R.T. 51/2022"]
[null,null,"2023-02-01",8433218,3748097,4685122,5622145,1597071,"Res. S.R.T. 51/2022"]
[null,null,"2023-02-02",8433218,3748097,4685122,5622145,1597071,"Res. S.R.T. 51/2022"]
[null,null,"2023-02-03",8433218,3748097,4685122,5622145,1597071,"Res. S.R.T. 51/2022"]
[null,null,"2023-02-04",8433218,3748097,4685122,5622145,1597071,"Res. S.R.T. 51/2022"]
[null,null,"2023-02-05",8433218,3748097,4685122,5622145,1597071,"Res. S.R.T. 51/2022"]
[null,null,"2023-02-06",8433218,3748097,4685122,5622145,1597071,"Res. S.R.T. 51/2022"]
[null,null,"2023-02-07",8433218,3748097,4685122,5622145,1597071,"Res. S.R.T. 51/2022"]
[null,null,"2023-02-08",8433218,3748097,4685122,5622145,1597071,"Res. S.R.T. 51/2022"]
[null,null,"2023-02-09",8433218,3748097,4685122,5622145,1597071,"Res. S.R.T. 51/2022"]
[null,null,"2023-02-10",8433218,3748097,4685122,5622145,1597071,"Res. S.R.T. 51/2022"]
[null,null,"2023-02-11",8433218,3748097,4685122,5622145,1597071,"Res. S.R.T. 51/2022"]
[null,null,"2023-02-12",8433218,3748097,4685122,5622145,1597071,"Res. S.R.T. 51/2022"]
[null,null,"2023-02-13",8433218,3748097,4685122,5622145,1597071,"Res. S.R.T. 51/2022"]
[null,null,"2023-02-14",8433218,3748097,4685122,5622145,1597071,"Res. S.R.T. 51/2022"]
[null,null,"2023-02-15",8433218,3748097,4685122,5622145,1597071,"Res. S.R.T. 51/2022"]
[null,null,"2023-02-16",8433218,3748097,4685122,5622145,1597071,"Res. S.R.T. 51/2022"]
[null,null,"2023-02-17",8433218,3748097,4685122,5622145,1597071,"Res. S.R.T. 51/2022"]
[null,null,"2023-02-18",8433218,3748097,4685122,5622145,1597071,"Res. S.R.T. 51/2022"]
[null,null,"2023-02-19",8433218,3748097,4685122,5622145,1597071,"Res. S.R.T. 51/2022"]
[null,null,"2023-02-20",8433218,3748097,4685122,5622145,1597071,"Res. S.R.T. 51/2022"]
[null,null,"2023-02-21",8433218,3748097,4685122,5622145,1597071,"Res. S.R.T. 51/2022"]
[null,null,"2023-02-22",8433218,3748097,4685122,5622145,1597071,"Res. S.R.T. 51/2022"]
[null,null,"2023-02-23",8433218,3748097,4685122,5622145,1597071,"Res. S.R.T. 51/2022"]
[null,null,"2023-02-24",8433218,3748097,4685122,5622145,1597071,"Res. S.R.T. 51/2022"]
[null,null,"2023-02-25",8433218,3748097,4685122,5622145,1597071,"Res. S.R.T. 51/2022"]
[null,null,"2023-02-26",8433218,3748097,4685122,5622145,1597071,"Res. S.R.T. 51/2022"]
[null,null,"2023-02-27",8433218,3748097,4685122,5622145,1597071,"Res. S.R.T. 51/2022"]
[null,null,"2023-02-28",8433218,3748097,4685122,5622145,1597071,"Res. S.R.T. 51/2022"]
[null,null,"2023-03-01",11589837,5151039,6438799,7726557,2194867,"Res. S.R.T. 12/2023"]
[null,null,"2023-03-02",11589837,5151039,6438799,7726557,2194867,"Res. S.R.T. 12/2023"]
[null,null,"2023-03-03",11589837,5151039,6438799,7726557,2194867,"Res. S.R.T. 12/2023"]
[null,null,"2023-03-04",11589837,5151039,6438799,7726557,2194867,"Res. S.R.T. 12/2023"]
[null,null,"2023-03-05",11589837,5151039,6438799,7726557,2194867,"Res. S.R.T. 12/2023"]
[null,null,"2023-03-06",11589837,5151039,6438799,7726557,2194867,"Res. S.R.T. 12/2023"]
[null,null,"2023-03-07",11589837,5151039,6438799,7726557,2194867,"Res. S.R.T. 12/2023"]
[null,null,"2023-03-08",11589837,5151039,6438799,7726557,2194867,"Res. S.R.T. 12/2023"]
[null,null,"2023-03-09",11589837,5151039,6438799,7726557,2194867,"Res. S.R.T. 12/2023"]
[null,null,"2023-03-10",11589837,5151039,6438799,7726557,2194867,"Res. S.R.T. 12/2023"]
[null,null,"2023-03-11",11589837,5151039,6438799,7726557,2194867,"Res. S.R.T. 12/2023"]
[null,null,"2023-03-12",11589837,5151039,6438799,7726557,2194867,"Res. S.R.T. 12/2023"]
[null,null,"2023-03-13",11589837,5151039,6438799,7726557,2194867,"Res. S.R.T. 12/2023"]
[null,null,"2023-03-14",11589837,5151039,6438799,7726557,2194867,"Res. S.R.T. 12/2023"]
[null,null,"2023-03-15",11589837,5151039,6438799,7726557,2194867,"Res. S.R.T. 12/2023"]
[null,null,"2023-03-16",11589837,5151039,6438799,7726557,2194867,"Res. S.R.T. 12/2023"]
[null,null,"2023-03-17",11589837,5151039,6438799,7726557,2194867,"Res. S.R.T. 12/2023"]
[null,null,"2023-03-18",11589837,5151039,6438799,7726557,2194867,"Res. S.R.T. 12/2023"]
[null,null,"2023-03-19",11589837,5151039,6438799,7726557,2194867,"Res. S.R.T. 12/2023"]
[null,null,"2023-03-20",11589837,5151039,6438799,7726557,2194867,"Res. S.R.T. 12/2023"]
[null,null,"2023-03-21",11589837,5151039,6438799,7726557,2194867,"Res. S.R.T. 12/2023"]
[null,null,"2023-03-22",11589837,5151039,6438799,7726557,2194867,"Res. S.R.T. 12/2023"]
[null,null,"2023-03-23",11589837,5151039,6438799,7726557,2194867,"Res. S.R.T. 12/2023"]
[null,null,"2023-03-24",11589837,5151039,6438799,7726557,2194867,"Res. S.R.T. 12/2023"]
[null,null,"2023-03-25",11589837,5151039,6438799,7726557,2194867,"Res. S.R.T. 12/2023"]
[null,null,"2023-03-26",11589837,5151039,6438799,7726557,2194867,"Res. S.R.T. 12/2023"]
[null,null,"2023-03-27",11589837,5151039,6438799,7726557,2194867,"Res. S.R.T. 12/2023"]
[null,null,"2023-03-28",11589837,5151039,6438799,7726557,2194867,"Res. S.R.T. 12/2023"]
[null,null,"2023-03-29",11589837,5151039,6438799,7726557,2194867,"Res. S.R.T. 12/2023"]
[null,null,"2023-03-30",11589837,5151039,6438799,7726557,2194867,"Res. S.R.T. 12/2023"]
[null,null,"2023-03-31",11589837,5151039,6438799,7726557,2194867,"Res. S.R.T. 12/2023"]
[null,null,"2023-04-01",11589837,5151039,6438799,7726557,2194867,"Res. S.R.T. 12/2023"]
[null,null,"2023-04-02",11589837,5151039,6438799,7726557,2194867,"Res. S.R.T. 12/2023"]
[null,null,"2023-04-03",11589837,5151039,6438799,7726557,2194867,"Res. S.R.T. 12/2023"]
[null,null,"2023-04-04",11589837,5151039,6438799,7726557,2194867,"Res. S.R.T. 12/2023"]
[null,null,"2023-04-05",11589837,5151039,6438799,7726557,2194867,"Res. S.R.T. 12/2023"]
[null,null,"2023-04-06",11589837,5151039,6438799,7726557,2194867,"Res. S.R.T. 12/2023"]
[null,null,"2023-04-07",11589837,5151039,6438799,7726557,2194867,"Res. S.R.T. 12/2023"]
[null,null,"2023-04-08",11589837,5151039,6438799,7726557,2194867,"Res. S.R.T. 12/2023"]
[null,null,"2023-04-09",11589837,5151039,6438799,7726557,2194867,"Res. S.R.T. 12/2023"]
[null,null,"2023-04-10",11589837,5151039,6438799,7726557,2194867,"Res. S.R.T. 12/2023"]
[null,null,"2023-04-11",11589837,5151039,6438799,7726557,2194867,"Res. S.R.T. 12/2023"]
[null,null,"2023-04-12",11589837,5151039,6438799,7726557,2194867,"Res. S.R.T. 12/2023"]
[null,null,"2023-04-13",11589837,5151039,6438799,7726557,2194867,"Res. S.R.T. 12/2023"]
[null,null,"2023-04-14",11589837,5151039,6438799,7726557,2194867,"Res. S.R.T. 12/2023"]
[null,null,"2023-04-15",11589837,5151039,6438799,7726557,2194867,"Res. S.R.T. 12/2023"]
[null,null,"2023-04-16",11589837,5151039,6438799,7726557,2194867,"Res. S.R.T. 12/2023"]
[null,null,"2023-04-17",11589837,5151039,6438799,7726557,2194867,"Res. S.R.T. 12/2023"]
[null,null,"2023-04-18",11589837,5151039,6438799,7726557,2194867,"Res. S.R.T. 12/2023"]
[null,null,"2023-04-19",11589837,5151039,6438799,7726557,2194867,"Res. S.R.T. 12/2023"]
[null,null,"2023-04-20",11589837,5151039,6438799,7726557,2194867,"Res. S.R.T. 12/2023"]
[null,null,"2023-04-21",11589837,5151039,6438799,7726557,2194867,"Res. S.R.T. 12/2023"]
[null,null,"2023-04-22",11589837,5151039,6438799,7726557,2194867,"Res. S.R.T. 12/2023"]
[null,null,"2023-04-23",11589837,5151039,6438799,7726557,2194867,"Res. S.R.T. 12/2023"]
[null,null,"2023-04-24",11589837,5151039,6438799,7726557,2194867,"Res. S.R.T. 12/2023"]
[null,null,"2023-04-25",11589837,5151039,6438799,7726557,2194867,"Res. S.R.T. 12/2023"]
[null,null,"2023-04-26",11589837,5151039,6438799,7726557,2194867,"Res. S.R.T. 12/2023"]
[null,null,"2023-04-27",11589837,5151039,6438799,7726557,2194867,"Res. S.R.T. 12/2023"]
[null,null,"2023-04-28",11589837,5151039,6438799,7726557,2194867,"Res. S.R.T. 12/2023"]
[null,null,"2023-04-29",11589837,5151039,6438799,7726557,2194867,"Res. S.R.T. 12/2023"]
[null,null,"2023-04-30",11589837,5151039,6438799,7726557,2194867,"Res. S.R.T. 12/2023"]
[null,null,"2023-05-01",11589837,5151039,6438799,7726557,2194867,"Res. S.R.T. 12/2023"]
[null,null,"2023-05-02",11589837,5151039,6438799,7726557,2194867,"Res. S.R.T. 12/2023"]
[null,null,"2023-05-03",11589837,5151039,6438799,7726557,2194867,"Res. S.R.T. 12/2023"]
[null,null,"2023-05-04",11589837,5151039,6438799,7726557,2194867,"Res. S.R.T. 12/2023"]
[null,null,"2023-05-05",11589837,5151039,6438799,7726557,2194867,"Res. S.R.T. 12/2023"]
[null,null,"2023-05-06",11589837,5151039,6438799,7726557,2194867,"Res. S.R.T. 12/2023"]
[null,null,"2023-05-07",11589837,5151039,6438799,7726557,2194867,"Res. S.R.T. 12/2023"]
[null,null,"2023-05-08",11589837,5151039,6438799,7726557,2194867,"Res. S.R.T. 12/2023"]
[null,null,"2023-05-09",11589837,5151039,6438799,7726557,2194867,"Res. S.R.T. 12/2023"]
[null,null,"2023-05-10",11589837,5151039,6438799,7726557,2194867,"Res. S.R.T. 12/2023"]
[null,null,"2023-05-11",11589837,5151039,6438799,7726557,2194867,"Res. S.R.T. 12/2023"]
[null,null,"2023-05-12",11589837,5151039,6438799,7726557,2194867,"Res. S.R.T. 12/2023"]
[null,null,"2023-05-13",11589837,5151039,6438799,7726557,2194867,"Res. S.R.T. 12/2023"]
[null,null,"2023-05-14",11589837,5151039,6438799,7726557,2194867,"Res. S.R.T. 12/2023"]
[null,null,"2023-05-15",11589837,5151039,6438799,7726557,2194867,"Res. S.R.T. 12/2023"]
[null,null,"2023-05-16",11589837,5151039,6438799,7726557,2194867,"Res. S.R.T. 12/2023"]
[null,null,"2023-05-17",11589837,5151039,6438799,7726557,2194867,"Res. S.R.T. 12/2023"]
[null,null,"2023-05-18",11589837,5151039,6438799,7726557,2194867,"Res. S.R.T. 12/2023"]
[null,null,"2023-05-19",11589837,5151039,6438799,7726557,2194867,"Res. S.R.T. 12/2023"]
[null,null,"2023-05-20",11589837,5151039,6438799,7726557,2194867,"Res. S.R.T. 12/2023"]
[null,null,"2023-05-21",11589837,5151039,6438799,7726557,2194867,"Res. S.R.T. 12/2023"]
[null,null,"2023-05-22",11589837,5151039,6438799,7726557,2194867,"Res. S.R.T. 12/2023"]
[null,null,"2023-05-23",11589837,5151039,6438799,7726557,2194867,"Res. S.R.T. 12/2023"]
[null,null,"2023-05-24",11589837,5151039,6438799,7726557,2194867,"Res. S.R.T. 12/2023"]
[null,null,"2023-05-25",11589837,5151039,6438799,7726557,2194867,"Res. S.R.T. 12/2023"]
[null,null,"2023-05-26",11589837,5151039,6438799,7726557,2194867,"Res. S.R.T. 12/2023"]
[null,null,"2023-05-27",11589837,5151039,6438799,7726557,2194867,"Res. S.R.T. 12/2023"]
[null,null,"2023-05-28",11589837,5151039,6438799,7726557,2194867,"Res. S.R.T. 12/2023"]
[null,null,"2023-05-29",11589837,5151039,6438799,7726557,2194867,"Res. S.R.T. 12/2023"]
[null,null,"2023-05-30",11589837,5151039,6438799,7726557,2194867,"Res. S.R.T. 12/2023"]
[null,null,"2023-05-31",11589837,5151039,6438799,7726557,2194867,"Res. S.R.T. 12/2023"]
[null,null,"2023-06-01",11589837,5151039,6438799,7726557,2194867,"Res. S.R.T. 12/2023"]
[null,null,"2023-06-02",11589837,5151039,6438799,7726557,2194867,"Res. S.R.T. 12/2023"]
[null,null,"2023-06-03",11589837,5151039,6438799,7726557,2194867,"Res. S.R.T. 12/2023"]
[null,null,"2023-06-04",11589837,5151039,6438799,7726557,2194867,"Res. S.R.T. 12/2023"]
[null,null,"2023-06-05",11589837,5151039,6438799,7726557,2194867,"Res. S.R.T. 12/2023"]
[null,null,"2023-06-06",11589837,5151039,6438799,7726557,2194867,"Res. S.R.T. 12/2023"]
[null,null,"2023-06-07",11589837,5151039,6438799,7726557,2194867,"Res. S.R.T. 12/2023"]
[null,null,"2023-06-08",11589837,5151039,6438799,7726557,2194867,"Res. S.R.T. 12/2023"]
[null,null,"2023-06-09",11589837,5151039,6438799,7726557,2194867,"Res. S.R.T. 12/2023"]
[null,null,"2023-06-10",11589837,5151039,6438799,7726557,2194867,"Res. S.R.T. 12/2023"]
[null,null,"2023-06-11",11589837,5151039,6438799,7726557,2194867,"Res. S.R.T. 12/2023"]
[null,null,"2023-06-12",11589837,5151039,6438799,7726557,2194867,"Res. S.R.T. 12/2023"]
[null,null,"2023-06-13",11589837,5151039,6438799,7726557,2194867,"Res. S.R.T. 12/2023"]
[null,null,"2023-06-14",11589837,5151039,6438799,7726557,2194867,"Res. S.R.T. 12/2023"]
[null,null,"2023-06-15",11589837,5151039,6438799,7726557,2194867,"Res. S.R.T. 12/2023"]
[null,null,"2023-06-16",11589837,5151039,6438799,7726557,2194867,"Res. S.R.T. 12/2023"]
[null,null,"2023-06-17",11589837,5151039,6438799,7726557,2194867,"Res. S.R.T. 12/2023"]
[null,null,"2023-06-18",11589837,5151039,6438799,7726557,2194867,"Res. S.R.T. 12/2023"]
[null,null,"2023-06-19",11589837,5151039,6438799,7726557,2194867,"Res. S.R.T. 12/2023"]
[null,null,"2023-06-20",11589837,5151039,6438799,7726557,2194867,"Res. S.R.T. 12/2023"]
[null,null,"2023-06-21",11589837,5151039,6438799,7726557,2194867,"Res. S.R.T. 12/2023"]
[null,null,"2023-06-22",11589837,5151039,6438799,7726557,2194867,"Res. S.R.T. 12/2023"]
[null,null,"2023-06-23",11589837,5151039,6438799,7726557,2194867,"Res. S.R.T. 12/2023"]
[null,null,"2023-06-24",11589837,5151039,6438799,7726557,2194867,"Res. S.R.T. 12/2023"]
[null,null,"2023-06-25",11589837,5151039,6438799,7726557,2194867,"Res. S.R.T. 12/2023"]
[null,null,"2023-06-26",11589837,5151039,6438799,7726557,2194867,"Res. S.R.T. 12/2023"]
[null,null,"2023-06-27",11589837,5151039,6438799,7726557,2194867,"Res. S.R.T. 12/2023"]
[null,null,"2023-06-28",11589837,5151039,6438799,7726557,2194867,"Res. S.R.T. 12/2023"]
[null,null,"2023-06-29",11589837,5151039,6438799,7726557,2194867,"Res. S.R.T. 12/2023"]
[null,null,"2023-06-30",11589837,5151039,6438799,7726557,2194867,"Res. S.R.T. 12/2023"]
[null,null,"2023-07-01",11589837,5151039,6438799,7726557,2194867,"Res. S.R.T. 12/2023"]
[null,null,"2023-07-02",11589837,5151039,6438799,7726557,2194867,"Res. S.R.T. 12/2023"]
[null,null,"2023-07-03",11589837,5151039,6438799,7726557,2194867,"Res. S.R.T. 12/2023"]
[null,null,"2023-07-04",11589837,5151039,6438799,7726557,2194867,"Res. S.R.T. 12/2023"]
[null,null,"2023-07-05",11589837,5151039,6438799,7726557,2194867,"Res. S.R.T. 12/2023"]
[null,null,"2023-07-06",11589837,5151039,6438799,7726557,2194867,"Res. S.R.T. 12/2023"]
[null,null,"2023-07-07",11589837,5151039,6438799,7726557,2194867,"Res. S.R.T. 12/2023"]
[null,null,"2023-07-08",11589837,5151039,6438799,7726557,2194867,"Res. S.R.T. 12/2023"]
[null,null,"2023-07-09",11589837,5151039,6438799,7726557,2194867,"Res. S.R.T. 12/2023"]
[null,null,"2023-07-10",11589837,5151039,6438799,7726557,2194867,"Res. S.R.T. 12/2023"]
[null,null,"2023-07-11",11589837,5151039,6438799,7726557,2194867,"Res. S.R.T. 12/2023"]
[null,null,"2023-07-12",11589837,5151039,6438799,7726557,2194867,"Res. S.R.T. 12/2023"]
[null,null,"2023-07-13",11589837,5151039,6438799,7726557,2194867,"Res. S.R.T. 12/2023"]
[null,null,"2023-07-14",11589837,5151039,6438799,7726557,2194867,"Res. S.R.T. 12/2023"]
[null,null,"2023-07-15",11589837,5151039,6438799,7726557,2194867,"Res. S.R.T. 12/2023"]
[null,null,"2023-07-16",11589837,5151039,6438799,7726557,2194867,"Res. S.R.T. 12/2023"]
[null,null,"2023-07-17",11589837,5151039,6438799,7726557,2194867,"Res. S.R.T. 12/2023"]
[null,null,"2023-07-18",11589837,5151039,6438799,7726557,2194867,"Res. S.R.T. 12/2023"]
[null,null,"2023-07-19",11589837,5151039,6438799,7726557,2194867,"Res. S.R.T. 12/2023"]
[null,null,"2023-07-20",11589837,5151039,6438799,7726557,2194867,"Res. S.R.T. 12/2023"]
[null,null,"2023-07-21",11589837,5151039,6438799,7726557,2194867,"Res. S.R.T. 12/2023"]
[null,null,"2023-07-22",11589837,5151039,6438799,7726557,2194867,"Res. S.R.T. 12/2023"]
[null,null,"2023-07-23",11589837,5151039,6438799,7726557,2194867,"Res. S.R.T. 12/2023"]
[null,null,"2023-07-24",11589837,5151039,6438799,7726557,2194867,"Res. S.R.T. 12/2023"]
[null,null,"2023-07-25",11589837,5151039,6438799,7726557,2194867,"Res. S.R.T. 12/2023"]
[null,null,"2023-07-26",11589837,5151039,6438799,7726557,2194867,"Res. S.R.T. 12/2023"]
[null,null,"2023-07-27",11589837,5151039,6438799,7726557,2194867,"Res. S.R.T. 12/2023"]
[null,null,"2023-07-28",11589837,5151039,6438799,7726557,2194867,"Res. S.R.T. 12/2023"]
[null,null,"2023-07-29",11589837,5151039,6438799,7726557,2194867,"Res. S.R.T. 12/2023"]
[null,null,"2023-07-30",11589837,5151039,6438799,7726557,2194867,"Res. S.R.T. 12/2023"]
[null,null,"2023-07-31",11589837,5151039,6438799,7726557,2194867,"Res. S.R.T. 12/2023"]
[null,null,"2023-08-01",11589837,5151039,6438799,7726557,2194867,"Res. S.R.T. 12/2023"]
[null,null,"2023-08-02",11589837,5151039,6438799,7726557,2194867,"Res. S.R.T. 12/2023"]
[null,null,"2023-08-03",11589837,5151039,6438799,7726557,2194867,"Res. S.R.T. 12/2023"]
[null,null,"2023-08-04",11589837,5151039,6438799,7726557,2194867,"Res. S.R.T. 12/2023"]
[null,null,"2023-08-05",11589837,5151039,6438799,7726557,2194867,"Res. S.R.T. 12/2023"]
[null,null,"2023-08-06",11589837,5151039,6438799,7726557,2194867,"Res. S.R.T. 12/2023"]
[null,null,"2023-08-07",11589837,5151039,6438799,7726557,2194867,"Res. S.R.T. 12/2023"]
[null,null,"2023-08-08",11589837,5151039,6438799,7726557,2194867,"Res. S.R.T. 12/2023"]
[null,null,"2023-08-09",11589837,5151039,6438799,7726557,2194867,"Res. S.R.T. 12/2023"]
[null,null,"2023-08-10",11589837,5151039,6438799,7726557,2194867,"Res. S.R.T. 12/2023"]
[null,null,"2023-08-11",11589837,5151039,6438799,7726557,2194867,"Res. S.R.T. 12/2023"]
[null,null,"2023-08-12",11589837,5151039,6438799,7726557,2194867,"Res. S.R.T. 12/2023"]
[null,null,"2023-08-13",11589837,5151039,6438799,7726557,2194867,"Res. S.R.T. 12/2023"]
[null,null,"2023-08-14",11589837,5151039,6438799,7726557,2194867,"Res. S.R.T. 12/2023"]
[null,null,"2023-08-15",11589837,5151039,6438799,7726557,2194867,"Res. S.R.T. 12/2023"]
[null,null,"2023-08-16",11589837,5151039,6438799,7726557,2194867,"Res. S.R.T. 12/2023"]
[null,null,"2023-08-17",11589837,5151039,6438799,7726557,2194867,"Res. S.R.T. 12/2023"]
[null,null,"2023-08-18",11589837,5151039,6438799,7726557,2194867,"Res. S.R.T. 12/2023"]
[null,null,"2023-08-19",11589837,5151039,6438799,7726557,2194867,"Res. S.R.T. 12/2023"]
[null,null,"2023-08-20",11589837,5151039,6438799,7726557,2194867,"Res. S.R.T. 12/2023"]
[null,null,"2023-08-21",11589837,5151039,6438799,7726557,2194867,"Res. S.R.T. 12/2023"]
[null,null,"2023-08-22",11589837,5151039,6438799,7726557,2194867,"Res. S.R.T. 12/2023"]
[null,null,"2023-08-23",11589837,5151039,6438799,7726557,2194867,"Res. S.R.T. 12/2023"]
[null,null,"2023-08-24",11589837,5151039,6438799,7726557,2194867,"Res. S.R.T. 12/2023"]
[null,null,"2023-08-25",11589837,5151039,6438799,7726557,2194867,"Res. S.R.T. 12/2023"]
[null,null,"2023-08-26",11589837,5151039,6438799,7726557,2194867,"Res. S.R.T. 12/2023"]
[null,null,"2023-08-27",11589837,5151039,6438799,7726557,2194867,"Res. S.R.T. 12/2023"]
[null,null,"2023-08-28",11589837,5151039,6438799,7726557,2194867,"Res. S.R.T. 12/2023"]
[null,null,"2023-08-29",11589837,5151039,6438799,7726557,2194867,"Res. S.R.T. 12/2023"]
[null,null,"2023-08-30",11589837,5151039,6438799,7726557,2194867,"Res. S.R.T. 12/2023"]
[null,null,"2023-08-31",11589837,5151039,6438799,7726557,2194867,"Res. S.R.T. 12/2023"]
[null,null,"2023-09-01",18059225,8026323,10032904,12039481,3420024,"Res. S.R.T. 39/2023"]
[null,null,"2023-09-02",18059225,8026323,10032904,12039481,3420024,"Res. S.R.T. 39/2023"]
[null,null,"2023-09-03",18059225,8026323,10032904,12039481,3420024,"Res. S.R.T. 39/2023"]
[null,null,"2023-09-04",18059225,8026323,10032904,12039481,3420024,"Res. S.R.T. 39/2023"]
[null,null,"2023-09-05",18059225,8026323,10032904,12039481,3420024,"Res. S.R.T. 39/2023"]
[null,null,"2023-09-06",18059225,8026323,10032904,12039481,3420024,"Res. S.R.T. 39/2023"]
[null,null,"2023-09-07",18059225,8026323,10032904,12039481,3420024,"Res. S.R.T. 39/2023"]
[null,null,"2023-09-08",18059225,8026323,10032904,12039481,3420024,"Res. S.R.T. 39/2023"]
[null,null,"2023-09-09",18059225,8026323,10032904,12039481,3420024,"Res. S.R.T. 39/2023"]
[null,null,"2023-09-10",18059225,8026323,10032904,12039481,3420024,"Res. S.R.T. 39/2023"]
[null,null,"2023-09-11",18059225,8026323,10032904,12039481,3420024,"Res. S.R.T. 39/2023"]
[null,null,"2023-09-12",18059225,8026323,10032904,12039481,3420024,"Res. S.R.T. 39/2023"]
[null,null,"2023-09-13",18059225,8026323,10032904,12039481,3420024,"Res. S.R.T. 39/2023"]
[null,null,"2023-09-14",18059225,8026323,10032904,12039481,3420024,"Res. S.R.T. 39/2023"]
[null,null,"2023-09-15",18059225,8026323,10032904,12039481,3420024,"Res. S.R.T. 39/2023"]
[null,null,"2023-09-16",18059225,8026323,10032904,12039481,3420024,"Res. S.R.T. 39/2023"]
[null,null,"2023-09-17",18059225,8026323,10032904,12039481,3420024,"Res. S.R.T. 39/2023"]
[null,null,"2023-09-18",18059225,8026323,10032904,12039481,3420024,"Res. S.R.T. 39/2023"]
[null,null,"2023-09-19",18059225,8026323,10032904,12039481,3420024,"Res. S.R.T. 39/2023"]
[null,null,"2023-09-20",18059225,8026323,10032904,12039481,3420024,"Res. S.R.T. 39/2023"]
[null,null,"2023-09-21",18059225,8026323,10032904,12039481,3420024,"Res. S.R.T. 39/2023"]
[null,null,"2023-09-22",18059225,8026323,10032904,12039481,3420024,"Res. S.R.T. 39/2023"]
[null,null,"2023-09-23",18059225,8026323,10032904,12039481,3420024,"Res. S.R.T. 39/2023"]
[null,null,"2023-09-24",18059225,8026323,10032904,12039481,3420024,"Res. S.R.T. 39/2023"]
[null,null,"2023-09-25",18059225,8026323,10032904,12039481,3420024,"Res. S.R.T. 39/2023"]
[null,null,"2023-09-26",18059225,8026323,10032904,12039481,3420024,"Res. S.R.T. 39/2023"]
[null,null,"2023-09-27",18059225,8026323,10032904,12039481,3420024,"Res. S.R.T. 39/2023"]
[null,null,"2023-09-28",18059225,8026323,10032904,12039481,3420024,"Res. S.R.T. 39/2023"]
[null,null,"2023-09-29",18059225,8026323,10032904,12039481,3420024,"Res. S.R.T. 39/2023"]
[null,null,"2023-09-30",18059225,8026323,10032904,12039481,3420024,"Res. S.R.T. 39/2023"]
[null,null,"2023-10-01",18059225,8026323,10032904,12039481,3420024,"Res. S.R.T. 39/2023"]
[null,null,"2023-10-02",18059225,8026323,10032904,12039481,3420024,"Res. S.R.T. 39/2023"]
[null,null,"2023-10-03",18059225,8026323,10032904,12039481,3420024,"Res. S.R.T. 39/2023"]
[null,null,"2023-10-04",18059225,8026323,10032904,12039481,3420024,"Res. S.R.T. 39/2023"]
[null,null,"2023-10-05",18059225,8026323,10032904,12039481,3420024,"Res. S.R.T. 39/2023"]
[null,null,"2023-10-06",18059225,8026323,10032904,12039481,3420024,"Res. S.R.T. 39/2023"]
[null,null,"2023-10-07",18059225,8026323,10032904,12039481,3420024,"Res. S.R.T. 39/2023"]
[null,null,"2023-10-08",18059225,8026323,10032904,12039481,3420024,"Res. S.R.T. 39/2023"]
[null,null,"2023-10-09",18059225,8026323,10032904,12039481,3420024,"Res. S.R.T. 39/2023"]
[null,null,"2023-10-10",18059225,8026323,10032904,12039481,3420024,"Res. S.R.T. 39/2023"]
[null,null,"2023-10-11",18059225,8026323,10032904,12039481,3420024,"Res. S.R.T. 39/2023"]
[null,null,"2023-10-12",18059225,8026323,10032904,12039481,3420024,"Res. S.R.T. 39/2023"]
[null,null,"2023-10-13",18059225,8026323,10032904,12039481,3420024,"Res. S.R.T. 39/2023"]
[null,null,"2023-10-14",18059225,8026323,10032904,12039481,3420024,"Res. S.R.T. 39/2023"]
[null,null,"2023-10-15",18059225,8026323,10032904,12039481,3420024,"Res. S.R.T. 39/2023"]
[null,null,"2023-10-16",18059225,8026323,10032904,12039481,3420024,"Res. S.R.T. 39/2023"]
[null,null,"2023-10-17",18059225,8026323,10032904,12039481,3420024,"Res. S.R.T. 39/2023"]
[null,null,"2023-10-18",18059225,8026323,10032904,12039481,3420024,"Res. S.R.T. 39/2023"]
[null,null,"2023-10-19",18059225,8026323,10032904,12039481,3420024,"Res. S.R.T. 39/2023"]
[null,null,"2023-10-20",18059225,8026323,10032904,12039481,3420024,"Res. S.R.T. 39/2023"]
[null,null,"2023-10-21",18059225,8026323,10032904,12039481,3420024,"Res. S.R.T. 39/2023"]
[null,null,"2023-10-22",18059225,8026323,10032904,12039481,3420024,"Res. S.R.T. 39/2023"]
[null,null,"2023-10-23",18059225,8026323,10032904,12039481,3420024,"Res. S.R.T. 39/2023"]
[null,null,"2023-10-24",18059225,8026323,10032904,12039481,3420024,"Res. S.R.T. 39/2023"]
[null,null,"2023-10-25",18059225,8026323,10032904,12039481,3420024,"Res. S.R.T. 39/2023"]
[null,null,"2023-10-26",18059225,8026323,10032904,12039481,3420024,"Res. S.R.T. 39/2023"]
[null,null,"2023-10-27",18059225,8026323,10032904,12039481,3420024,"Res. S.R.T. 39/2023"]
[null,null,"2023-10-28",18059225,8026323,10032904,12039481,3420024,"Res. S.R.T. 39/2023"]
[null,null,"2023-10-29",18059225,8026323,10032904,12039481,3420024,"Res. S.R.T. 39/2023"]
[null,null,"2023-10-30",18059225,8026323,10032904,12039481,3420024,"Res. S.R.T. 39/2023"]
[null,null,"2023-10-31",18059225,8026323,10032904,12039481,3420024,"Res. S.R.T. 39/2023"]
[null,null,"2023-11-01",18059225,8026323,10032904,12039481,3420024,"Res. S.R.T. 39/2023"]
[null,null,"2023-11-02",18059225,8026323,10032904,12039481,3420024,"Res. S.R.T. 39/2023"]
[null,null,"2023-11-03",18059225,8026323,10032904,12039481,3420024,"Res. S.R.T. 39/2023"]
[null,null,"2023-11-04",18059225,8026323,10032904,12039481,3420024,"Res. S.R.T. 39/2023"]
[null,null,"2023-11-05",18059225,8026323,10032904,12039481,3420024,"Res. S.R.T. 39/2023"]
[null,null,"2023-11-06",18059225,8026323,10032904,12039481,3420024,"Res. S.R.T. 39/2023"]
[null,null,"2023-11-07",18059225,8026323,10032904,12039481,3420024,"Res. S.R.T. 39/2023"]
[null,null,"2023-11-08",18059225,8026323,10032904,12039481,3420024,"Res. S.R.T. 39/2023"]
[null,null,"2023-11-09",18059225,8026323,10032904,12039481,3420024,"Res. S.R.T. 39/2023"]
[null,null,"2023-11-10",18059225,8026323,10032904,12039481,3420024,"Res. S.R.T. 39/2023"]
[null,null,"2023-11-11",18059225,8026323,10032904,12039481,3420024,"Res. S.R.T. 39/2023"]
[null,null,"2023-11-12",18059225,8026323,10032904,12039481,3420024,"Res. S.R.T. 39/2023"]
[null,null,"2023-11-13",18059225,8026323,10032904,12039481,3420024,"Res. S.R.T. 39/2023"]
[null,null,"2023-11-14",18059225,8026323,10032904,12039481,3420024,"Res. S.R.T. 39/2023"]
[null,null,"2023-11-15",18059225,8026323,10032904,12039481,3420024,"Res. S.R.T. 39/2023"]
[null,null,"2023-11-16",18059225,8026323,10032904,12039481,3420024,"Res. S.R.T. 39/2023"]
[null,null,"2023-11-17",18059225,8026323,10032904,12039481,3420024,"Res. S.R.T. 39/2023"]
[null,null,"2023-11-18",18059225,8026323,10032904,12039481,3420024,"Res. S.R.T. 39/2023"]
[null,null,"2023-11-19",18059225,8026323,10032904,12039481,3420024,"Res. S.R.T. 39/2023"]
[null,null,"2023-11-20",18059225,8026323,10032904,12039481,3420024,"Res. S.R.T. 39/2023"]
[null,null,"2023-11-21",18059225,8026323,10032904,12039481,3420024,"Res. S.R.T. 39/2023"]
[null,null,"2023-11-22",18059225,8026323,10032904,12039481,3420024,"Res. S.R.T. 39/2023"]
[null,null,"2023-11-23",18059225,8026323,10032904,12039481,3420024,"Res. S.R.T. 39/2023"]
[null,null,"2023-11-24",18059225,8026323,10032904,12039481,3420024,"Res. S.R.T. 39/2023"]
[null,null,"2023-11-25",18059225,8026323,10032904,12039481,3420024,"Res. S.R.T. 39/2023"]
[null,null,"2023-11-26",18059225,8026323,10032904,12039481,3420024,"Res. S.R.T. 39/2023"]
[null,null,"2023-11-27",18059225,8026323,10032904,12039481,3420024,"Res. S.R.T. 39/2023"]
[null,null,"2023-11-28",18059225,8026323,10032904,12039481,3420024,"Res. S.R.T. 39/2023"]
[null,null,"2023-11-29",18059225,8026323,10032904,12039481,3420024,"Res. S.R.T. 39/2023"]
[null,null,"2023-11-30",18059225,8026323,10032904,12039481,3420024,"Res. S.R.T. 39/2023"]
[null,null,"2023-12-01",18059225,8026323,10032904,12039481,3420024,"Res. S.R.T. 39/2023"]
[null,null,"2023-12-02",18059225,8026323,10032904,12039481,3420024,"Res. S.R.T. 39/2023"]
[null,null,"2023-12-03",18059225,8026323,10032904,12039481,3420024,"Res. S.R.T. 39/2023"]
[null,null,"2023-12-04",18059225,8026323,10032904,12039481,3420024,"Res. S.R.T. 39/2023"]
[null,null,"2023-12-05",18059225,8026323,10032904,12039481,3420024,"Res. S.R.T. 39/2023"]
[null,null,"2023-12-06",18059225,8026323,10032904,12039481,3420024,"Res. S.R.T. 39/2023"]
[null,null,"2023-12-07",18059225,8026323,10032904,12039481,3420024,"Res. S.R.T. 39/2023"]
[null,null,"2023-12-08",18059225,8026323,10032904,12039481,3420024,"Res. S.R.T. 39/2023"]
[null,null,"2023-12-09",18059225,8026323,10032904,12039481,3420024,"Res. S.R.T. 39/2023"]
[null,null,"2023-12-10",18059225,8026323,10032904,12039481,3420024,"Res. S.R.T. 39/2023"]
[null,null,"2023-12-11",18059225,8026323,10032904,12039481,3420024,"Res. S.R.T. 39/2023"]
[null,null,"2023-12-12",18059225,8026323,10032904,12039481,3420024,"Res. S.R.T. 39/2023"]
[null,null,"2023-12-13",18059225,8026323,10032904,12039481,3420024,"Res. S.R.T. 39/2023"]
[null,null,"2023-12-14",18059225,8026323,10032904,12039481,3420024,"Res. S.R.T. 39/2023"]
[null,null,"2023-12-15",18059225,8026323,10032904,12039481,3420024,"Res. S.R.T. 39/2023"]
[null,null,"2023-12-16",18059225,8026323,10032904,12039481,3420024,"Res. S.R.T. 39/2023"]
[null,null,"2023-12-17",18059225,8026323,10032904,12039481,3420024,"Res. S.R.T. 39/2023"]
[null,null,"2023-12-18",18059225,8026323,10032904,12039481,3420024,"Res. S.R.T. 39/2023"]
[null,null,"2023-12-19",18059225,8026323,10032904,12039481,3420024,"Res. S.R.T. 39/2023"]
[null,null,"2023-12-20",18059225,8026323,10032904,12039481,3420024,"Res. S.R.T. 39/2023"]
[null,null,"2023-12-21",18059225,8026323,10032904,12039481,3420024,"Res. S.R.T. 39/2023"]
[null,null,"2023-12-22",18059225,8026323,10032904,12039481,3420024,"Res. S.R.T. 39/2023"]
[null,null,"2023-12-23",18059225,8026323,10032904,12039481,3420024,"Res. S.R.T. 39/2023"]
[null,null,"2023-12-24",18059225,8026323,10032904,12039481,3420024,"Res. S.R.T. 39/2023"]
[null,null,"2023-12-25",18059225,8026323,10032904,12039481,3420024,"Res. S.R.T. 39/2023"]
[null,null,"2023-12-26",18059225,8026323,10032904,12039481,3420024,"Res. S.R.T. 39/2023"]
[null,null,"2023-12-27",18059225,8026323,10032904,12039481,3420024,"Res. S.R.T. 39/2023"]
[null,null,"2023-12-28",18059225,8026323,10032904,12039481,3420024,"Res. S.R.T. 39/2023"]
[null,null,"2023-12-29",18059225,8026323,10032904,12039481,3420024,"Res. S.R.T. 39/2023"]
[null,null,"2023-12-30",18059225,8026323,10032904,12039481,3420024,"Res. S.R.T. 39/2023"]
[null,null,"2023-12-31",18059225,8026323,10032904,12039481,3420024,"Res. S.R.T. 39/2023"]
[null,null,"2024-01-01",18059225,8026323,10032904,12039481,3420024,"Res. S.R.T. 39/2023"]
[null,null,"2024-01-02",18059225,8026323,10032904,12039481,3420024,"Res. S.R.T. 39/2023"]
[null,null,"2024-01-03",18059225,8026323,10032904,12039481,3420024,"Res. S.R.T. 39/2023"]
[null,null,"2024-01-04",18059225,8026323,10032904,12039481,3420024,"Res. S.R.T. 39/2023"]
[null,null,"2024-01-05",18059225,8026323,10032904,12039481,3420024,"Res. S.R.T. 39/2023"]
[null,null,"2024-01-06",18059225,8026323,10032904,12039481,3420024,"Res. S.R.T. 39/2023"]
[null,null,"2024-01-07",18059225,8026323,10032904,12039481,3420024,"Res. S.R.T. 39/2023"]
[null,null,"2024-01-08",18059225,8026323,10032904,12039481,3420024,"Res. S.R.T. 39/2023"]
[null,null,"2024-01-09",18059225,8026323,10032904,12039481,3420024,"Res. S.R.T. 39/2023"]
[null,null,"2024-01-10",18059225,8026323,10032904,12039481,3420024,"Res. S.R.T. 39/2023"]
[null,null,"2024-01-11",18059225,8026323,10032904,12039481,3420024,"Res. S.R.T. 39/2023"]
[null,null,"2024-01-12",18059225,8026323,10032904,12039481,3420024,"Res. S.R.T. 39/2023"]
[null,null,"2024-01-13",18059225,8026323,10032904,12039481,3420024,"Res. S.R.T. 39/2023"]
[null,null,"2024-01-14",18059225,8026323,10032904,12039481,3420024,"Res. S.R.T. 39/2023"]
[null,null,"2024-01-15",18059225,8026323,10032904,12039481,3420024,"Res. S.R.T. 39/2023"]
[null,null,"2024-01-16",18059225,8026323,10032904,12039481,3420024,"Res. S.R.T. 39/2023"]
[null,null,"2024-01-17",18059225,8026323,10032904,12039481,3420024,"Res. S.R.T. 39/2023"]
[null,null,"2024-01-18",18059225,8026323,10032904,12039481,3420024,"Res. S.R.T. 39/2023"]
[null,null,"2024-01-19",18059225,8026323,10032904,12039481,3420024,"Res. S.R.T. 39/2023"]
[null,null,"2024-01-20",18059225,8026323,10032904,12039481,3420024,"Res. S.R.T. 39/2023"]
[null,null,"2024-01-21",18059225,8026323,10032904,12039481,3420024,"Res. S.R.T. 39/2023"]
[null,null,"2024-01-22",18059225,8026323,10032904,12039481,3420024,"Res. S.R.T. 39/2023"]
[null,null,"2024-01-23",18059225,8026323,10032904,12039481,3420024,"Res. S.R.T. 39/2023"]
[null,null,"2024-01-24",18059225,8026323,10032904,12039481,3420024,"Res. S.R.T. 39/2023"]
[null,null,"2024-01-25",18059225,8026323,10032904,12039481,3420024,"Res. S.R.T. 39/2023"]
[null,null,"2024-01-26",18059225,8026323,10032904,12039481,3420024,"Res. S.R.T. 39/2023"]
[null,null,"2024-01-27",18059225,8026323,10032904,12039481,3420024,"Res. S.R.T. 39/2023"]
[null,null,"2024-01-28",18059225,8026323,10032904,12039481,3420024,"Res. S.R.T. 39/2023"]
[null,null,"2024-01-29",18059225,8026323,10032904,12039481,3420024,"Res. S.R.T. 39/2023"]
[null,null,"2024-01-30",18059225,8026323,10032904,12039481,3420024,"Res. S.R.T. 39/2023"]
[null,null,"2024-01-31",18059225,8026323,10032904,12039481,3420024,"Res. S.R.T. 39/2023"]
[null,null,"2024-02-01",18059225,8026323,10032904,12039481,3420024,"Res. S.R.T. 39/2023"]
[null,null,"2024-02-02",18059225,8026323,10032904,12039481,3420024,"Res. S.R.T. 39/2023"]
[null,null,"2024-02-03",18059225,8026323,10032904,12039481,3420024,"Res. S.R.T. 39/2023"]
[null,null,"2024-02-04",18059225,8026323,10032904,12039481,3420024,"Res. S.R.T. 39/2023"]
[null,null,"2024-02-05",18059225,8026323,10032904,12039481,3420024,"Res. S.R.T. 39/2023"]
[null,null,"2024-02-06",18059225,8026323,10032904,12039481,3420024,"Res. S.R.T. 39/2023"]
[null,null,"2024-02-07",18059225,8026323,10032904,12039481,3420024,"Res. S.R.T. 39/2023"]
[null,null,"2024-02-08",18059225,8026323,10032904,12039481,3420024,"Res. S.R.T. 39/2023"]
[null,null,"2024-02-09",18059225,8026323,10032904,12039481,3420024,"Res. S.R.T. 39/2023"]
[null,null,"2024-02-10",18059225,8026323,10032904,12039481,3420024,"Res. S.R.T. 39/2023"]
[null,null,"2024-02-11",18059225,8026323,10032904,12039481,3420024,"Res. S.R.T. 39/2023"]
[null,null,"2024-02-12",18059225,8026323,10032904,12039481,3420024,"Res. S.R.T. 39/2023"]
[null,null,"2024-02-13",18059225,8026323,10032904,12039481,3420024,"Res. S.R.T. 39/2023"]
[null,null,"2024-02-14",18059225,8026323,10032904,12039481,3420024,"Res. S.R.T. 39/2023"]
[null,null,"2024-02-15",18059225,8026323,10032904,12039481,3420024,"Res. S.R.T. 39/2023"]
[null,null,"2024-02-16",18059225,8026323,10032904,12039481,3420024,"Res. S.R.T. 39/2023"]
[null,null,"2024-02-17",18059225,8026323,10032904,12039481,3420024,"Res. S.R.T. 39/2023"]
[null,null,"2024-02-18",18059225,8026323,10032904,12039481,3420024,"Res. S.R.T. 39/2023"]
[null,null,"2024-02-19",18059225,8026323,10032904,12039481,3420024,"Res. S.R.T. 39/2023"]
[null,null,"2024-02-20",18059225,8026323,10032904,12039481,3420024,"Res. S.R.T. 39/2023"]
[null,null,"2024-02-21",18059225,8026323,10032904,12039481,3420024,"Res. S.R.T. 39/2023"]
[null,null,"2024-02-22",18059225,8026323,10032904,12039481,3420024,"Res. S.R.T. 39/2023"]
[null,null,"2024-02-23",18059225,8026323,10032904,12039481,3420024,"Res. S.R.T. 39/2023"]
[null,null,"2024-02-24",18059225,8026323,10032904,12039481,3420024,"Res. S.R.T. 39/2023"]
[null,null,"2024-02-25",18059225,8026323,10032904,12039481,3420024,"Res. S.R.T. 39/2023"]
[null,null,"2024-02-26",18059225,8026323,10032904,12039481,3420024,"Res. S.R.T. 39/2023"]
[null,null,"2024-02-27",18059225,8026323,10032904,12039481,3420024,"Res. S.R.T. 39/2023"]
[null,null,"2024-02-28",18059225,8026323,10032904,12039481,3420024,"Res. S.R.T. 39/2023"]
[null,null,"2024-02-29",18059225,8026323,10032904,12039481,3420024,"Res. S.R.T. 39/2023"]
[null,null,"2024-03-01",28906583,12847372,16059215,19271052,5474277,"Res. S.R.T. 18/2024"]
[null,null,"2024-03-02",28906583,12847372,16059215,19271052,5474277,"Res. S.R.T. 18/2024"]
[null,null,"2024-03-03",28906583,12847372,16059215,19271052,5474277,"Res. S.R.T. 18/2024"]
[null,null,"2024-03-04",28906583,12847372,16059215,19271052,5474277,"Res. S.R.T. 18/2024"]
[null,null,"2024-03-05",28906583,12847372,16059215,19271052,5474277,"Res. S.R.T. 18/2024"]
[null,null,"2024-03-06",28906583,12847372,16059215,19271052,5474277,"Res. S.R.T. 18/2024"]
[null,null,"2024-03-07",28906583,12847372,16059215,19271052,5474277,"Res. S.R.T. 18/2024"]
[null,null,"2024-03-08",28906583,12847372,16059215,19271052,5474277,"Res. S.R.T. 18/2024"]
[null,null,"2024-03-09",28906583,12847372,16059215,19271052,5474277,"Res. S.R.T. 18/2024"]
[null,null,"2024-03-10",28906583,12847372,16059215,19271052,5474277,"Res. S.R.T. 18/2024"]
[null,null,"2024-03-11",28906583,12847372,16059215,19271052,5474277,"Res. S.R.T. 18/2024"]
[null,null,"2024-03-12",28906583,12847372,16059215,19271052,5474277,"Res. S.R.T. 18/2024"]
[null,null,"2024-03-13",28906583,12847372,16059215,19271052,5474277,"Res. S.R.T. 18/2024"]
[null,null,"2024-03-14",28906583,12847372,16059215,19271052,5474277,"Res. S.R.T. 18/2024"]
[null,null,"2024-03-15",28906583,12847372,16059215,19271052,5474277,"Res. S.R.T. 18/2024"]
[null,null,"2024-03-16",28906583,12847372,16059215,19271052,5474277,"Res. S.R.T. 18/2024"]
[null,null,"2024-03-17",28906583,12847372,16059215,19271052,5474277,"Res. S.R.T. 18/2024"]
[null,null,"2024-03-18",28906583,12847372,16059215,19271052,5474277,"Res. S.R.T. 18/2024"]
[null,null,"2024-03-19",28906583,12847372,16059215,19271052,5474277,"Res. S.R.T. 18/2024"]
[null,null,"2024-03-20",28906583,12847372,16059215,19271052,5474277,"Res. S.R.T. 18/2024"]
[null,null,"2024-03-21",28906583,12847372,16059215,19271052,5474277,"Res. S.R.T. 18/2024"]
[null,null,"2024-03-22",28906583,12847372,16059215,19271052,5474277,"Res. S.R.T. 18/2024"]
[null,null,"2024-03-23",28906583,12847372,16059215,19271052,5474277,"Res. S.R.T. 18/2024"]
[null,null,"2024-03-24",28906583,12847372,16059215,19271052,5474277,"Res. S.R.T. 18/2024"]
[null,null,"2024-03-25",28906583,12847372,16059215,19271052,5474277,"Res. S.R.T. 18/2024"]
[null,null,"2024-03-26",28906583,12847372,16059215,19271052,5474277,"Res. S.R.T. 18/2024"]
[null,null,"2024-03-27",28906583,12847372,16059215,19271052,5474277,"Res. S.R.T. 18/2024"]
[null,null,"2024-03-28",28906583,12847372,16059215,19271052,5474277,"Res. S.R.T. 18/2024"]
[null,null,"2024-03-29",28906583,12847372,16059215,19271052,5474277,"Res. S.R.T. 18/2024"]
[null,null,"2024-03-30",28906583,12847372,16059215,19271052,5474277,"Res. S.R.T. 18/2024"]
[null,null,"2024-03-31",28906583,12847372,16059215,19271052,5474277,"Res. S.R.T. 18/2024"]
[null,null,"2024-04-01",28906583,12847372,16059215,19271052,5474277,"Res. S.R.T. 18/2024"]
[null,null,"2024-04-02",28906583,12847372,16059215,19271052,5474277,"Res. S.R.T. 18/2024"]
[null,null,"2024-04-03",28906583,12847372,16059215,19271052,5474277,"Res. S.R.T. 18/2024"]
[null,null,"2024-04-04",28906583,12847372,16059215,19271052,5474277,"Res. S.R.T. 18/2024"]
[null,null,"2024-04-05",28906583,12847372,16059215,19271052,5474277,"Res. S.R.T. 18/2024"]
[null,null,"2024-04-06",28906583,12847372,16059215,19271052,5474277,"Res. S.R.T. 18/2024"]
[null,null,"2024-04-07",28906583,12847372,16059215,19271052,5474277,"Res. S.R.T. 18/2024"]
[null,null,"2024-04-08",28906583,12847372,16059215,19271052,5474277,"Res. S.R.T. 18/2024"]
[null,null,"2024-04-09",28906583,12847372,16059215,19271052,5474277,"Res. S.R.T. 18/2024"]
[null,null,"2024-04-10",28906583,12847372,16059215,19271052,5474277,"Res. S.R.T. 18/2024"]
[null,null,"2024-04-11",28906583,12847372,16059215,19271052,5474277,"Res. S.R.T. 18/2024"]
[null,null,"2024-04-12",28906583,12847372,16059215,19271052,5474277,"Res. S.R.T. 18/2024"]
[null,null,"2024-04-13",28906583,12847372,16059215,19271052,5474277,"Res. S.R.T. 18/2024"]
[null,null,"2024-04-14",28906583,12847372,16059215,19271052,5474277,"Res. S.R.T. 18/2024"]
[null,null,"2024-04-15",28906583,12847372,16059215,19271052,5474277,"Res. S.R.T. 18/2024"]
[null,null,"2024-04-16",28906583,12847372,16059215,19271052,5474277,"Res. S.R.T. 18/2024"]
[null,null,"2024-04-17",28906583,12847372,16059215,19271052,5474277,"Res. S.R.T. 18/2024"]
[null,null,"2024-04-18",28906583,12847372,16059215,19271052,5474277,"Res. S.R.T. 18/2024"]
[null,null,"2024-04-19",28906583,12847372,16059215,19271052,5474277,"Res. S.R.T. 18/2024"]
[null,null,"2024-04-20",28906583,12847372,16059215,19271052,5474277,"Res. S.R.T. 18/2024"]
[null,null,"2024-04-21",28906583,12847372,16059215,19271052,5474277,"Res. S.R.T. 18/2024"]
[null,null,"2024-04-22",28906583,12847372,16059215,19271052,5474277,"Res. S.R.T. 18/2024"]
[null,null,"2024-04-23",28906583,12847372,16059215,19271052,5474277,"Res. S.R.T. 18/2024"]
[null,null,"2024-04-24",28906583,12847372,16059215,19271052,5474277,"Res. S.R.T. 18/2024"]
[null,null,"2024-04-25",28906583,12847372,16059215,19271052,5474277,"Res. S.R.T. 18/2024"]
[null,null,"2024-04-26",28906583,12847372,16059215,19271052,5474277,"Res. S.R.T. 18/2024"]
[null,null,"2024-04-27",28906583,12847372,16059215,19271052,5474277,"Res. S.R.T. 18/2024"]
[null,null,"2024-04-28",28906583,12847372,16059215,19271052,5474277,"Res. S.R.T. 18/2024"]
[null,null,"2024-04-29",28906583,12847372,16059215,19271052,5474277,"Res. S.R.T. 18/2024"]
[null,null,"2024-04-30",28906583,12847372,16059215,19271052,5474277,"Res. S.R.T. 18/2024"]
[null,null,"2024-05-01",28906583,12847372,16059215,19271052,5474277,"Res. S.R.T. 18/2024"]
[null,null,"2024-05-02",28906583,12847372,16059215,19271052,5474277,"Res. S.R.T. 18/2024"]
[null,null,"2024-05-03",28906583,12847372,16059215,19271052,5474277,"Res. S.R.T. 18/2024"]
[null,null,"2024-05-04",28906583,12847372,16059215,19271052,5474277,"Res. S.R.T. 18/2024"]
[null,null,"2024-05-05",28906583,12847372,16059215,19271052,5474277,"Res. S.R.T. 18/2024"]
[null,null,"2024-05-06",28906583,12847372,16059215,19271052,5474277,"Res. S.R.T. 18/2024"]
[null,null,"2024-05-07",28906583,12847372,16059215,19271052,5474277,"Res. S.R.T. 18/2024"]
[null,null,"2024-05-08",28906583,12847372,16059215,19271052,5474277,"Res. S.R.T. 18/2024"]
[null,null,"2024-05-09",28906583,12847372,16059215,19271052,5474277,"Res. S.R.T. 18/2024"]
[null,null,"2024-05-10",28906583,12847372,16059215,19271052,5474277,"Res. S.R.T. 18/2024"]
[null,null,"2024-05-11",28906583,12847372,16059215,19271052,5474277,"Res. S.R.T. 18/2024"]
[null,null,"2024-05-12",28906583,12847372,16059215,19271052,5474277,"Res. S.R.T. 18/2024"]
[null,null,"2024-05-13",28906583,12847372,16059215,19271052,5474277,"Res. S.R.T. 18/2024"]
[null,null,"2024-05-14",28906583,12847372,16059215,19271052,5474277,"Res. S.R.T. 18/2024"]
[null,null,"2024-05-15",28906583,12847372,16059215,19271052,5474277,"Res. S.R.T. 18/2024"]
[null,null,"2024-05-16",28906583,12847372,16059215,19271052,5474277,"Res. S.R.T. 18/2024"]
[null,null,"2024-05-17",28906583,12847372,16059215,19271052,5474277,"Res. S.R.T. 18/2024"]
[null,null,"2024-05-18",28906583,12847372,16059215,19271052,5474277,"Res. S.R.T. 18/2024"]
[null,null,"2024-05-19",28906583,12847372,16059215,19271052,5474277,"Res. S.R.T. 18/2024"]
[null,null,"2024-05-20",28906583,12847372,16059215,19271052,5474277,"Res. S.R.T. 18/2024"]
[null,null,"2024-05-21",28906583,12847372,16059215,19271052,5474277,"Res. S.R.T. 18/2024"]
[null,null,"2024-05-22",28906583,12847372,16059215,19271052,5474277,"Res. S.R.T. 18/2024"]
[null,null,"2024-05-23",28906583,12847372,16059215,19271052,5474277,"Res. S.R.T. 18/2024"]
[null,null,"2024-05-24",28906583,12847372,16059215,19271052,5474277,"Res. S.R.T. 18/2024"]
[null,null,"2024-05-25",28906583,12847372,16059215,19271052,5474277,"Res. S.R.T. 18/2024"]
[null,null,"2024-05-26",28906583,12847372,16059215,19271052,5474277,"Res. S.R.T. 18/2024"]
[null,null,"2024-05-27",28906583,12847372,16059215,19271052,5474277,"Res. S.R.T. 18/2024"]
[null,null,"2024-05-28",28906583,12847372,16059215,19271052,5474277,"Res. S.R.T. 18/2024"]
[null,null,"2024-05-29",28906583,12847372,16059215,19271052,5474277,"Res. S.R.T. 18/2024"]
[null,null,"2024-05-30",28906583,12847372,16059215,19271052,5474277,"Res. S.R.T. 18/2024"]
[null,null,"2024-05-31",28906583,12847372,16059215,19271052,5474277,"Res. S.R.T. 18/2024"]
[null,null,"2024-06-01",28906583,12847372,16059215,19271052,5474277,"Res. S.R.T. 18/2024"]
[null,null,"2024-06-02",28906583,12847372,16059215,19271052,5474277,"Res. S.R.T. 18/2024"]
[null,null,"2024-06-03",28906583,12847372,16059215,19271052,5474277,"Res. S.R.T. 18/2024"]
[null,null,"2024-06-04",28906583,12847372,16059215,19271052,5474277,"Res. S.R.T. 18/2024"]
[null,null,"2024-06-05",28906583,12847372,16059215,19271052,5474277,"Res. S.R.T. 18/2024"]
[null,null,"2024-06-06",28906583,12847372,16059215,19271052,5474277,"Res. S.R.T. 18/2024"]
[null,null,"2024-06-07",28906583,12847372,16059215,19271052,5474277,"Res. S.R.T. 18/2024"]
[null,null,"2024-06-08",28906583,12847372,16059215,19271052,5474277,"Res. S.R.T. 18/2024"]
[null,null,"2024-06-09",28906583,12847372,16059215,19271052,5474277,"Res. S.R.T. 18/2024"]
[null,null,"2024-06-10",28906583,12847372,16059215,19271052,5474277,"Res. S.R.T. 18/2024"]
[null,null,"2024-06-11",28906583,12847372,16059215,19271052,5474277,"Res. S.R.T. 18/2024"]
[null,null,"2024-06-12",28906583,12847372,16059215,19271052,5474277,"Res. S.R.T. 18/2024"]
[null,null,"2024-06-13",28906583,12847372,16059215,19271052,5474277,"Res. S.R.T. 18/2024"]
[null,null,"2024-06-14",28906583,12847372,16059215,19271052,5474277,"Res. S.R.T. 18/2024"]
[null,null,"2024-06-15",28906583,12847372,16059215,19271052,5474277,"Res. S.R.T. 18/2024"]
[null,null,"2024-06-16",28906583,12847372,16059215,19271052,5474277,"Res. S.R.T. 18/2024"]
[null,null,"2024-06-17",28906583,12847372,16059215,19271052,5474277,"Res. S.R.T. 18/2024"]
[null,null,"2024-06-18",28906583,12847372,16059215,19271052,5474277,"Res. S.R.T. 18/2024"]
[null,null,"2024-06-19",28906583,12847372,16059215,19271052,5474277,"Res. S.R.T. 18/2024"]
[null,null,"2024-06-20",28906583,12847372,16059215,19271052,5474277,"Res. S.R.T. 18/2024"]
[null,null,"2024-06-21",28906583,12847372,16059215,19271052,5474277,"Res. S.R.T. 18/2024"]
[null,null,"2024-06-22",28906583,12847372,16059215,19271052,5474277,"Res. S.R.T. 18/2024"]
[null,null,"2024-06-23",28906583,12847372,16059215,19271052,5474277,"Res. S.R.T. 18/2024"]
[null,null,"2024-06-24",28906583,12847372,16059215,19271052,5474277,"Res. S.R.T. 18/2024"]
[null,null,"2024-06-25",28906583,12847372,16059215,19271052,5474277,"Res. S.R.T. 18/2024"]
[null,null,"2024-06-26",28906583,12847372,16059215,19271052,5474277,"Res. S.R.T. 18/2024"]
[null,null,"2024-06-27",28906583,12847372,16059215,19271052,5474277,"Res. S.R.T. 18/2024"]
[null,null,"2024-06-28",28906583,12847372,16059215,19271052,5474277,"Res. S.R.T. 18/2024"]
[null,null,"2024-06-29",28906583,12847372,16059215,19271052,5474277,"Res. S.R.T. 18/2024"]
[null,null,"2024-06-30",28906583,12847372,16059215,19271052,5474277,"Res. S.R.T. 18/2024"]
[null,null,"2024-07-01",28906583,12847372,16059215,19271052,5474277,"Res. S.R.T. 18/2024"]
[null,null,"2024-07-02",28906583,12847372,16059215,19271052,5474277,"Res. S.R.T. 18/2024"]
[null,null,"2024-07-03",28906583,12847372,16059215,19271052,5474277,"Res. S.R.T. 18/2024"]
[null,null,"2024-07-04",28906583,12847372,16059215,19271052,5474277,"Res. S.R.T. 18/2024"]
[null,null,"2024-07-05",28906583,12847372,16059215,19271052,5474277,"Res. S.R.T. 18/2024"]
[null,null,"2024-07-06",28906583,12847372,16059215,19271052,5474277,"Res. S.R.T. 18/2024"]
[null,null,"2024-07-07",28906583,12847372,16059215,19271052,5474277,"Res. S.R.T. 18/2024"]
[null,null,"2024-07-08",28906583,12847372,16059215,19271052,5474277,"Res. S.R.T. 18/2024"]
[null,null,"2024-07-09",28906583,12847372,16059215,19271052,5474277,"Res. S.R.T. 18/2024"]
[null,null,"2024-07-10",28906583,12847372,16059215,19271052,5474277,"Res. S.R.T. 18/2024"]
[null,null,"2024-07-11",28906583,12847372,16059215,19271052,5474277,"Res. S.R.T. 18/2024"]
[null,null,"2024-07-12",28906583,12847372,16059215,19271052,5474277,"Res. S.R.T. 18/2024"]
[null,null,"2024-07-13",28906583,12847372,16059215,19271052,5474277,"Res. S.R.T. 18/2024"]
[null,null,"2024-07-14",28906583,12847372,16059215,19271052,5474277,"Res. S.R.T. 18/2024"]
[null,null,"2024-07-15",28906583,12847372,16059215,19271052,5474277,"Res. S.R.T. 18/2024"]
[null,null,"2024-07-16",28906583,12847372,16059215,19271052,5474277,"Res. S.R.T. 18/2024"]
[null,null,"2024-07-17",28906583,12847372,16059215,19271052,5474277,"Res. S.R.T. 18/2024"]
[null,null,"2024-07-18",28906583,12847372,16059215,19271052,5474277,"Res. S.R.T. 18/2024"]
[null,null,"2024-07-19",28906583,12847372,16059215,19271052,5474277,"Res. S.R.T. 18/2024"]
[null,null,"2024-07-20",28906583,12847372,16059215,19271052,5474277,"Res. S.R.T. 18/2024"]
[null,null,"2024-07-21",28906583,12847372,16059215,19271052,5474277,"Res. S.R.T. 18/2024"]
[null,null,"2024-07-22",28906583,12847372,16059215,19271052,5474277,"Res. S.R.T. 18/2024"]
[null,null,"2024-07-23",28906583,12847372,16059215,19271052,5474277,"Res. S.R.T. 18/2024"]
[null,null,"2024-07-24",28906583,12847372,16059215,19271052,5474277,"Res. S.R.T. 18/2024"]
[null,null,"2024-07-25",28906583,12847372,16059215,19271052,5474277,"Res. S.R.T. 18/2024"]
[null,null,"2024-07-26",28906583,12847372,16059215,19271052,5474277,"Res. S.R.T. 18/2024"]
[null,null,"2024-07-27",28906583,12847372,16059215,19271052,5474277,"Res. S.R.T. 18/2024"]
[null,null,"2024-07-28",28906583,12847372,16059215,19271052,5474277,"Res. S.R.T. 18/2024"]
[null,null,"2024-07-29",28906583,12847372,16059215,19271052,5474277,"Res. S.R.T. 18/2024"]
[null,null,"2024-07-30",28906583,12847372,16059215,19271052,5474277,"Res. S.R.T. 18/2024"]
[null,null,"2024-07-31",28906583,12847372,16059215,19271052,5474277,"Res. S.R.T. 18/2024"]
[null,null,"2024-08-01",28906583,12847372,16059215,19271052,5474277,"Res. S.R.T. 18/2024"]
[null,null,"2024-08-02",28906583,12847372,16059215,19271052,5474277,"Res. S.R.T. 18/2024"]
[null,null,"2024-08-03",28906583,12847372,16059215,19271052,5474277,"Res. S.R.T. 18/2024"]
[null,null,"2024-08-04",28906583,12847372,16059215,19271052,5474277,"Res. S.R.T. 18/2024"]
[null,null,"2024-08-05",28906583,12847372,16059215,19271052,5474277,"Res. S.R.T. 18/2024"]
[null,null,"2024-08-06",28906583,12847372,16059215,19271052,5474277,"Res. S.R.T. 18/2024"]
[null,null,"2024-08-07",28906583,12847372,16059215,19271052,5474277,"Res. S.R.T. 18/2024"]
[null,null,"2024-08-08",28906583,12847372,16059215,19271052,5474277,"Res. S.R.T. 18/2024"]
[null,null,"2024-08-09",28906583,12847372,16059215,19271052,5474277,"Res. S.R.T. 18/2024"]
[null,null,"2024-08-10",28906583,12847372,16059215,19271052,5474277,"Res. S.R.T. 18/2024"]
[null,null,"2024-08-11",28906583,12847372,16059215,19271052,5474277,"Res. S.R.T. 18/2024"]
[null,null,"2024-08-12",28906583,12847372,16059215,19271052,5474277,"Res. S.R.T. 18/2024"]
[null,null,"2024-08-13",28906583,12847372,16059215,19271052,5474277,"Res. S.R.T. 18/2024"]
[null,null,"2024-08-14",28906583,12847372,16059215,19271052,5474277,"Res. S.R.T. 18/2024"]
[null,null,"2024-08-15",28906583,12847372,16059215,19271052,5474277,"Res. S.R.T. 18/2024"]
[null,null,"2024-08-16",28906583,12847372,16059215,19271052,5474277,"Res. S.R.T. 18/2024"]
[null,null,"2024-08-17",28906583,12847372,16059215,19271052,5474277,"Res. S.R.T. 18/2024"]
[null,null,"2024-08-18",28906583,12847372,16059215,19271052,5474277,"Res. S.R.T. 18/2024"]
[null,null,"2024-08-19",28906583,12847372,16059215,19271052,5474277,"Res. S.R.T. 18/2024"]
[null,null,"2024-08-20",28906583,12847372,16059215,19271052,5474277,"Res. S.R.T. 18/2024"]
[null,null,"2024-08-21",28906583,12847372,16059215,19271052,5474277,"Res. S.R.T. 18/2024"]
[null,null,"2024-08-22",28906583,12847372,16059215,19271052,5474277,"Res. S.R.T. 18/2024"]
[null,null,"2024-08-23",28906583,12847372,16059215,19271052,5474277,"Res. S.R.T. 18/2024"]
[null,null,"2024-08-24",28906583,12847372,16059215,19271052,5474277,"Res. S.R.T. 18/2024"]
[null,null,"2024-08-25",28906583,12847372,16059215,19271052,5474277,"Res. S.R.T. 18/2024"]
[null,null,"2024-08-26",28906583,12847372,16059215,19271052,5474277,"Res. S.R.T. 18/2024"]
[null,null,"2024-08-27",28906583,12847372,16059215,19271052,5474277,"Res. S.R.T. 18/2024"]
[null,null,"2024-08-28",28906583,12847372,16059215,19271052,5474277,"Res. S.R.T. 18/2024"]
[null,null,"2024-08-29",28906583,12847372,16059215,19271052,5474277,"Res. S.R.T. 18/2024"]
[null,null,"2024-08-30",28906583,12847372,16059215,19271052,5474277,"Res. S.R.T. 18/2024"]
[null,null,"2024-08-31",28906583,12847372,16059215,19271052,5474277,"Res. S.R.T. 18/2024"]
[null,null,"2024-09-01",55699217,24755211,30944014,37132805,10548218,"Res. S.R.T. 55/2024"]
[null,null,"2024-09-02",55699217,24755211,30944014,37132805,10548218,"Res. S.R.T. 55/2024"]
[null,null,"2024-09-03",55699217,24755211,30944014,37132805,10548218,"Res. S.R.T. 55/2024"]
[null,null,"2024-09-04",55699217,24755211,30944014,37132805,10548218,"Res. S.R.T. 55/2024"]
[null,null,"2024-09-05",55699217,24755211,30944014,37132805,10548218,"Res. S.R.T. 55/2024"]
[null,null,"2024-09-06",55699217,24755211,30944014,37132805,10548218,"Res. S.R.T. 55/2024"]
[null,null,"2024-09-07",55699217,24755211,30944014,37132805,10548218,"Res. S.R.T. 55/2024"]
[null,null,"2024-09-08",55699217,24755211,30944014,37132805,10548218,"Res. S.R.T. 55/2024"]
[null,null,"2024-09-09",55699217,24755211,30944014,37132805,10548218,"Res. S.R.T. 55/2024"]
[null,null,"2024-09-10",55699217,24755211,30944014,37132805,10548218,"Res. S.R.T. 55/2024"]
[null,null,"2024-09-11",55699217,24755211,30944014,37132805,10548218,"Res. S.R.T. 55/2024"]
[null,null,"2024-09-12",55699217,24755211,30944014,37132805,10548218,"Res. S.R.T. 55/2024"]
[null,null,"2024-09-13",55699217,24755211,30944014,37132805,10548218,"Res. S.R.T. 55/2024"]
[null,null,"2024-09-14",55699217,24755211,30944014,37132805,10548218,"Res. S.R.T. 55/2024"]
[null,null,"2024-09-15",55699217,24755211,30944014,37132805,10548218,"Res. S.R.T. 55/2024"]
[null,null,"2024-09-16",55699217,24755211,30944014,37132805,10548218,"Res. S.R.T. 55/2024"]
[null,null,"2024-09-17",55699217,24755211,30944014,37132805,10548218,"Res. S.R.T. 55/2024"]
[null,null,"2024-09-18",55699217,24755211,30944014,37132805,10548218,"Res. S.R.T. 55/2024"]
[null,null,"2024-09-19",55699217,24755211,30944014,37132805,10548218,"Res. S.R.T. 55/2024"]
[null,null,"2024-09-20",55699217,24755211,30944014,37132805,10548218,"Res. S.R.T. 55/2024"]
[null,null,"2024-09-21",55699217,24755211,30944014,37132805,10548218,"Res. S.R.T. 55/2024"]
[null,null,"2024-09-22",55699217,24755211,30944014,37132805,10548218,"Res. S.R.T. 55/2024"]
[null,null,"2024-09-23",55699217,24755211,30944014,37132805,10548218,"Res. S.R.T. 55/2024"]
[null,null,"2024-09-24",55699217,24755211,30944014,37132805,10548218,"Res. S.R.T. 55/2024"]
[null,null,"2024-09-25",55699217,24755211,30944014,37132805,10548218,"Res. S.R.T. 55/2024"]
[null,null,"2024-09-26",55699217,24755211,30944014,37132805,10548218,"Res. S.R.T. 55/2024"]
[null,null,"2024-09-27",55699217,24755211,30944014,37132805,10548218,"Res. S.R.T. 55/2024"]
[null,null,"2024-09-28",55699217,24755211,30944014,37132805,10548218,"Res. S.R.T. 55/2024"]
[null,null,"2024-09-29",55699217,24755211,30944014,37132805,10548218,"Res. S.R.T. 55/2024"]
[null,null,"2024-09-30",55699217,24755211,30944014,37132805,10548218,"Res. S.R.T. 55/2024"]
[null,null,"2024-10-01",55699217,24755211,30944014,37132805,10548218,"Res. S.R.T. 55/2024"]
[null,null,"2024-10-02",55699217,24755211,30944014,37132805,10548218,"Res. S.R.T. 55/2024"]
[null,null,"2024-10-03",55699217,24755211,30944014,37132805,10548218,"Res. S.R.T. 55/2024"]
[null,null,"2024-10-04",55699217,24755211,30944014,37132805,10548218,"Res. S.R.T. 55/2024"]
[null,null,"2024-10-05",55699217,24755211,30944014,37132805,10548218,"Res. S.R.T. 55/2024"]
[null,null,"2024-10-06",55699217,24755211,30944014,37132805,10548218,"Res. S.R.T. 55/2024"]
[null,null,"2024-10-07",55699217,24755211,30944014,37132805,10548218,"Res. S.R.T. 55/2024"]
[null,null,"2024-10-08",55699217,24755211,30944014,37132805,10548218,"Res. S.R.T. 55/2024"]
[null,null,"2024-10-09",55699217,24755211,30944014,37132805,10548218,"Res. S.R.T. 55/2024"]
[null,null,"2024-10-10",55699217,24755211,30944014,37132805,10548218,"Res. S.R.T. 55/2024"]
[null,null,"2024-10-11",55699217,24755211,30944014,37132805,10548218,"Res. S.R.T. 55/2024"]
[null,null,"2024-10-12",55699217,24755211,30944014,37132805,10548218,"Res. S.R.T. 55/2024"]
[null,null,"2024-10-13",55699217,24755211,30944014,37132805,10548218,"Res. S.R.T. 55/2024"]
[null,null,"2024-10-14",55699217,24755211,30944014,37132805,10548218,"Res. S.R.T. 55/2024"]
[null,null,"2024-10-15",55699217,24755211,30944014,37132805,10548218,"Res. S.R.T. 55/2024"]
[null,null,"2024-10-16",55699217,24755211,30944014,37132805,10548218,"Res. S.R.T. 55/2024"]
[null,null,"2024-10-17",55699217,24755211,30944014,37132805,10548218,"Res. S.R.T. 55/2024"]
[null,null,"2024-10-18",55699217,24755211,30944014,37132805,10548218,"Res. S.R.T. 55/2024"]
[null,null,"2024-10-19",55699217,24755211,30944014,37132805,10548218,"Res. S.R.T. 55/2024"]
[null,null,"2024-10-20",55699217,24755211,30944014,37132805,10548218,"Res. S.R.T. 55/2024"]
[null,null,"2024-10-21",55699217,24755211,30944014,37132805,10548218,"Res. S.R.T. 55/2024"]
[null,null,"2024-10-22",55699217,24755211,30944014,37132805,10548218,"Res. S.R.T. 55/2024"]
[null,null,"2024-10-23",55699217,24755211,30944014,37132805,10548218,"Res. S.R.T. 55/2024"]
[null,null,"2024-10-24",55699217,24755211,30944014,37132805,10548218,"Res. S.R.T. 55/2024"]
[null,null,"2024-10-25",55699217,24755211,30944014,37132805,10548218,"Res. S.R.T. 55/2024"]
[null,null,"2024-10-26",55699217,24755211,30944014,37132805,10548218,"Res. S.R.T. 55/2024"]
[null,null,"2024-10-27",55699217,24755211,30944014,37132805,10548218,"Res. S.R.T. 55/2024"]
[null,null,"2024-10-28",55699217,24755211,30944014,37132805,10548218,"Res. S.R.T. 55/2024"]
[null,null,"2024-10-29",55699217,24755211,30944014,37132805,10548218,"Res. S.R.T. 55/2024"]
[null,null,"2024-10-30",55699217,24755211,30944014,37132805,10548218,"Res. S.R.T. 55/2024"]
[null,null,"2024-10-31",55699217,24755211,30944014,37132805,10548218,"Res. S.R.T. 55/2024"]
[null,null,"2024-11-01",55699217,24755211,30944014,37132805,10548218,"Res. S.R.T. 55/2024"]
[null,null,"2024-11-02",55699217,24755211,30944014,37132805,10548218,"Res. S.R.T. 55/2024"]
[null,null,"2024-11-03",55699217,24755211,30944014,37132805,10548218,"Res. S.R.T. 55/2024"]
[null,null,"2024-11-04",55699217,24755211,30944014,37132805,10548218,"Res. S.R.T. 55/2024"]
[null,null,"2024-11-05",55699217,24755211,30944014,37132805,10548218,"Res. S.R.T. 55/2024"]
[null,null,"2024-11-06",55699217,24755211,30944014,37132805,10548218,"Res. S.R.T. 55/2024"]
[null,null,"2024-11-07",55699217,24755211,30944014,37132805,10548218,"Res. S.R.T. 55/2024"]
[null,null,"2024-11-08",55699217,24755211,30944014,37132805,10548218,"Res. S.R.T. 55/2024"]
[null,null,"2024-11-09",55699217,24755211,30944014,37132805,10548218,"Res. S.R.T. 55/2024"]
[null,null,"2024-11-10",55699217,24755211,30944014,37132805,10548218,"Res. S.R.T. 55/2024"]
[null,null,"2024-11-11",55699217,24755211,30944014,37132805,10548218,"Res. S.R.T. 55/2024"]
[null,null,"2024-11-12",55699217,24755211,30944014,37132805,10548218,"Res. S.R.T. 55/2024"]
[null,null,"2024-11-13",55699217,24755211,30944014,37132805,10548218,"Res. S.R.T. 55/2024"]
[null,null,"2024-11-14",55699217,24755211,30944014,37132805,10548218,"Res. S.R.T. 55/2024"]
[null,null,"2024-11-15",55699217,24755211,30944014,37132805,10548218,"Res. S.R.T. 55/2024"]
[null,null,"2024-11-16",55699217,24755211,30944014,37132805,10548218,"Res. S.R.T. 55/2024"]
[null,null,"2024-11-17",55699217,24755211,30944014,37132805,10548218,"Res. S.R.T. 55/2024"]
[null,null,"2024-11-18",55699217,24755211,30944014,37132805,10548218,"Res. S.R.T. 55/2024"]
[null,null,"2024-11-19",55699217,24755211,30944014,37132805,10548218,"Res. S.R.T. 55/2024"]
[null,null,"2024-11-20",55699217,24755211,30944014,37132805,10548218,"Res. S.R.T. 55/2024"]
[null,null,"2024-11-21",55699217,24755211,30944014,37132805,10548218,"Res. S.R.T. 55/2024"]
[null,null,"2024-11-22",55699217,24755211,30944014,37132805,10548218,"Res. S.R.T. 55/2024"]
[null,null,"2024-11-23",55699217,24755211,30944014,37132805,10548218,"Res. S.R.T. 55/2024"]
[null,null,"2024-11-24",55699217,24755211,30944014,37132805,10548218,"Res. S.R.T. 55/2024"]
[null,null,"2024-11-25",55699217,24755211,30944014,37132805,10548218,"Res. S.R.T. 55/2024"]
[null,null,"2024-11-26",55699217,24755211,30944014,37132805,10548218,"Res. S.R.T. 55/2024"]
[null,null,"2024-11-27",55699217,24755211,30944014,37132805,10548218,"Res. S.R.T. 55/2024"]
[null,null,"2024-11-28",55699217,24755211,30944014,37132805,10548218,"Res. S.R.T. 55/2024"]
[null,null,"2024-11-29",55699217,24755211,30944014,37132805,10548218,"Res. S.R.T. 55/2024"]
[null,null,"2024-11-30",55699217,24755211,30944014,37132805,10548218,"Res. S.R.T. 55/2024"]
[null,null,"2024-12-01",55699217,24755211,30944014,37132805,10548218,"Res. S.R.T. 55/2024"]
[null,null,"2024-12-02",55699217,24755211,30944014,37132805,10548218,"Res. S.R.T. 55/2024"]
[null,null,"2024-12-03",55699217,24755211,30944014,37132805,10548218,"Res. S.R.T. 55/2024"]
[null,null,"2024-12-04",55699217,24755211,30944014,37132805,10548218,"Res. S.R.T. 55/2024"]
[null,null,"2024-12-05",55699217,24755211,30944014,37132805,10548218,"Res. S.R.T. 55/2024"]
[null,null,"2024-12-06",55699217,24755211,30944014,37132805,10548218,"Res. S.R.T. 55/2024"]
[null,null,"2024-12-07",55699217,24755211,30944014,37132805,10548218,"Res. S.R.T. 55/2024"]
[null,null,"2024-12-08",55699217,24755211,30944014,37132805,10548218,"Res. S.R.T. 55/2024"]
[null,null,"2024-12-09",55699217,24755211,30944014,37132805,10548218,"Res. S.R.T. 55/2024"]
[null,null,"2024-12-10",55699217,24755211,30944014,37132805,10548218,"Res. S.R.T. 55/2024"]
[null,null,"2024-12-11",55699217,24755211,30944014,37132805,10548218,"Res. S.R.T. 55/2024"]
[null,null,"2024-12-12",55699217,24755211,30944014,37132805,10548218,"Res. S.R.T. 55/2024"]
[null,null,"2024-12-13",55699217,24755211,30944014,37132805,10548218,"Res. S.R.T. 55/2024"]
[null,null,"2024-12-14",55699217,24755211,30944014,37132805,10548218,"Res. S.R.T. 55/2024"]
[null,null,"2024-12-15",55699217,24755211,30944014,37132805,10548218,"Res. S.R.T. 55/2024"]
[null,null,"2024-12-16",55699217,24755211,30944014,37132805,10548218,"Res. S.R.T. 55/2024"]
[null,null,"2024-12-17",55699217,24755211,30944014,37132805,10548218,"Res. S.R.T. 55/2024"]
[null,null,"2024-12-18",55699217,24755211,30944014,37132805,10548218,"Res. S.R.T. 55/2024"]
[null,null,"2024-12-19",55699217,24755211,30944014,37132805,10548218,"Res. S.R.T. 55/2024"]
[null,null,"2024-12-20",55699217,24755211,30944014,37132805,10548218,"Res. S.R.T. 55/2024"]
[null,null,"2024-12-21",55699217,24755211,30944014,37132805,10548218,"Res. S.R.T. 55/2024"]
[null,null,"2024-12-22",55699217,24755211,30944014,37132805,10548218,"Res. S.R.T. 55/2024"]
[null,null,"2024-12-23",55699217,24755211,30944014,37132805,10548218,"Res. S.R.T. 55/2024"]
[null,null,"2024-12-24",55699217,24755211,30944014,37132805,10548218,"Res. S.R.T. 55/2024"]
[null,null,"2024-12-25",55699217,24755211,30944014,37132805,10548218,"Res. S.R.T. 55/2024"]
[null,null,"2024-12-26",55699217,24755211,30944014,37132805,10548218,"Res. S.R.T. 55/2024"]
[null,null,"2024-12-27",55699217,24755211,30944014,37132805,10548218,"Res. S.R.T. 55/2024"]
[null,null,"2024-12-28",55699217,24755211,30944014,37132805,10548218,"Res. S.R.T. 55/2024"]
[null,null,"2024-12-29",55699217,24755211,30944014,37132805,10548218,"Res. S.R.T. 55/2024"]
[null,null,"2024-12-30",55699217,24755211,30944014,37132805,10548218,"Res. S.R.T. 55/2024"]
[null,null,"2024-12-31",55699217,24755211,30944014,37132805,10548218,"Res. S.R.T. 55/2024"]
[null,null,"2025-01-01",55699217,24755211,30944014,37132805,10548218,"Res. S.R.T. 55/2024"]
[null,null,"2025-01-02",55699217,24755211,30944014,37132805,10548218,"Res. S.R.T. 55/2024"]
[null,null,"2025-01-03",55699217,24755211,30944014,37132805,10548218,"Res. S.R.T. 55/2024"]
[null,null,"2025-01-04",55699217,24755211,30944014,37132805,10548218,"Res. S.R.T. 55/2024"]
[null,null,"2025-01-05",55699217,24755211,30944014,37132805,10548218,"Res. S.R.T. 55/2024"]
[null,null,"2025-01-06",55699217,24755211,30944014,37132805,10548218,"Res. S.R.T. 55/2024"]
[null,null,"2025-01-07",55699217,24755211,30944014,37132805,10548218,"Res. S.R.T. 55/2024"]
[null,null,"2025-01-08",55699217,24755211,30944014,37132805,10548218,"Res. S.R.T. 55/2024"]
[null,null,"2025-01-09",55699217,24755211,30944014,37132805,10548218,"Res. S.R.T. 55/2024"]
[null,null,"2025-01-10",55699217,24755211,30944014,37132805,10548218,"Res. S.R.T. 55/2024"]
[null,null,"2025-01-11",55699217,24755211,30944014,37132805,10548218,"Res. S.R.T. 55/2024"]
[null,null,"2025-01-12",55699217,24755211,30944014,37132805,10548218,"Res. S.R.T. 55/2024"]
[null,null,"2025-01-13",55699217,24755211,30944014,37132805,10548218,"Res. S.R.T. 55/2024"]
[null,null,"2025-01-14",55699217,24755211,30944014,37132805,10548218,"Res. S.R.T. 55/2024"]
[null,null,"2025-01-15",55699217,24755211,30944014,37132805,10548218,"Res. S.R.T. 55/2024"]
[null,null,"2025-01-16",55699217,24755211,30944014,37132805,10548218,"Res. S.R.T. 55/2024"]
[null,null,"2025-01-17",55699217,24755211,30944014,37132805,10548218,"Res. S.R.T. 55/2024"]
[null,null,"2025-01-18",55699217,24755211,30944014,37132805,10548218,"Res. S.R.T. 55/2024"]
[null,null,"2025-01-19",55699217,24755211,30944014,37132805,10548218,"Res. S.R.T. 55/2024"]
[null,null,"2025-01-20",55699217,24755211,30944014,37132805,10548218,"Res. S.R.T. 55/2024"]
[null,null,"2025-01-21",55699217,24755211,30944014,37132805,10548218,"Res. S.R.T. 55/2024"]
[null,null,"2025-01-22",55699217,24755211,30944014,37132805,10548218,"Res. S.R.T. 55/2024"]
[null,null,"2025-01-23",55699217,24755211,30944014,37132805,10548218,"Res. S.R.T. 55/2024"]
[null,null,"2025-01-24",55699217,24755211,30944014,37132805,10548218,"Res. S.R.T. 55/2024"]
[null,null,"2025-01-25",55699217,24755211,30944014,37132805,10548218,"Res. S.R.T. 55/2024"]
[null,null,"2025-01-26",55699217,24755211,30944014,37132805,10548218,"Res. S.R.T. 55/2024"]
[null,null,"2025-01-27",55699217,24755211,30944014,37132805,10548218,"Res. S.R.T. 55/2024"]
[null,null,"2025-01-28",55699217,24755211,30944014,37132805,10548218,"Res. S.R.T. 55/2024"]
[null,null,"2025-01-29",55699217,24755211,30944014,37132805,10548218,"Res. S.R.T. 55/2024"]
[null,null,"2025-01-30",55699217,24755211,30944014,37132805,10548218,"Res. S.R.T. 55/2024"]
[null,null,"2025-01-31",55699217,24755211,30944014,37132805,10548218,"Res. S.R.T. 55/2024"]
[null,null,"2025-02-01",55699217,24755211,30944014,37132805,10548218,"Res. S.R.T. 55/2024"]
[null,null,"2025-02-02",55699217,24755211,30944014,37132805,10548218,"Res. S.R.T. 55/2024"]
[null,null,"2025-02-03",55699217,24755211,30944014,37132805,10548218,"Res. S.R.T. 55/2024"]
[null,null,"2025-02-04",55699217,24755211,30944014,37132805,10548218,"Res. S.R.T. 55/2024"]
[null,null,"2025-02-05",55699217,24755211,30944014,37132805,10548218,"Res. S.R.T. 55/2024"]
[null,null,"2025-02-06",55699217,24755211,30944014,37132805,10548218,"Res. S.R.T. 55/2024"]
[null,null,"2025-02-07",55699217,24755211,30944014,37132805,10548218,"Res. S.R.T. 55/2024"]
[null,null,"2025-02-08",55699217,24755211,30944014,37132805,10548218,"Res. S.R.T. 55/2024"]
[null,null,"2025-02-09",55699217,24755211,30944014,37132805,10548218,"Res. S.R.T. 55/2024"]
[null,null,"2025-02-10",55699217,24755211,30944014,37132805,10548218,"Res. S.R.T. 55/2024"]
[null,null,"2025-02-11",55699217,24755211,30944014,37132805,10548218,"Res. S.R.T. 55/2024"]
[null,null,"2025-02-12",55699217,24755211,30944014,37132805,10548218,"Res. S.R.T. 55/2024"]
[null,null,"2025-02-13",55699217,24755211,30944014,37132805,10548218,"Res. S.R.T. 55/2024"]
[null,null,"2025-02-14",55699217,24755211,30944014,37132805,10548218,"Res. S.R.T. 55/2024"]
[null,null,"2025-02-15",55699217,24755211,30944014,37132805,10548218,"Res. S.R.T. 55/2024"]
[null,null,"2025-02-16",55699217,24755211,30944014,37132805,10548218,"Res. S.R.T. 55/2024"]
[null,null,"2025-02-17",55699217,24755211,30944014,37132805,10548218,"Res. S.R.T. 55/2024"]
[null,null,"2025-02-18",55699217,24755211,30944014,37132805,10548218,"Res. S.R.T. 55/2024"]
[null,null,"2025-02-19",55699217,24755211,30944014,37132805,10548218,"Res. S.R.T. 55/2024"]
[null,null,"2025-02-20",55699217,24755211,30944014,37132805,10548218,"Res. S.R.T. 55/2024"]
[null,null,"2025-02-21",55699217,24755211,30944014,37132805,10548218,"Res. S.R.T. 55/2024"]
[null,null,"2025-02-22",55699217,24755211,30944014,37132805,10548218,"Res. S.R.T. 55/2024"]
[null,null,"2025-02-23",55699217,24755211,30944014,37132805,10548218,"Res. S.R.T. 55/2024"]
[null,null,"2025-02-24",55699217,24755211,30944014,37132805,10548218,"Res. S.R.T. 55/2024"]
[null,null,"2025-02-25",55699217,24755211,30944014,37132805,10548218,"Res. S.R.T. 55/2024"]
[null,null,"2025-02-26",55699217,24755211,30944014,37132805,10548218,"Res. S.R.T. 55/2024"]
[null,null,"2025-02-27",55699217,24755211,30944014,37132805,10548218,"Res. S.R.T. 55/2024"]
[null,null,"2025-02-28",55699217,24755211,30944014,37132805,10548218,"Res. S.R.T. 55/2024"]
[null,null,"2025-03-01",71799818,31911034,39888793,47866537,13597321,"Res. S.R.T. 9/2025"]
[null,null,"2025-03-02",71799818,31911034,39888793,47866537,13597321,"Res. S.R.T. 9/2025"]
[null,null,"2025-03-03",71799818,31911034,39888793,47866537,13597321,"Res. S.R.T. 9/2025"]
[null,null,"2025-03-04",71799818,31911034,39888793,47866537,13597321,"Res. S.R.T. 9/2025"]
[null,null,"2025-03-05",71799818,31911034,39888793,47866537,13597321,"Res. S.R.T. 9/2025"]
[null,null,"2025-03-06",71799818,31911034,39888793,47866537,13597321,"Res. S.R.T. 9/2025"]
[null,null,"2025-03-07",71799818,31911034,39888793,47866537,13597321,"Res. S.R.T. 9/2025"]
[null,null,"2025-03-08",71799818,31911034,39888793,47866537,13597321,"Res. S.R.T. 9/2025"]
[null,null,"2025-03-09",71799818,31911034,39888793,47866537,13597321,"Res. S.R.T. 9/2025"]
[null,null,"2025-03-10",71799818,31911034,39888793,47866537,13597321,"Res. S.R.T. 9/2025"]
[null,null,"2025-03-11",71799818,31911034,39888793,47866537,13597321,"Res. S.R.T. 9/2025"]
[null,null,"2025-03-12",71799818,31911034,39888793,47866537,13597321,"Res. S.R.T. 9/2025"]
[null,null,"2025-03-13",71799818,31911034,39888793,47866537,13597321,"Res. S.R.T. 9/2025"]
[null,null,"2025-03-14",71799818,31911034,39888793,47866537,13597321,"Res. S.R.T. 9/2025"]
[null,null,"2025-03-15",71799818,31911034,39888793,47866537,13597321,"Res. S.R.T. 9/2025"]
[null,null,"2025-03-16",71799818,31911034,39888793,47866537,13597321,"Res. S.R.T. 9/2025"]
[null,null,"2025-03-17",71799818,31911034,39888793,47866537,13597321,"Res. S.R.T. 9/2025"]
[null,null,"2025-03-18",71799818,31911034,39888793,47866537,13597321,"Res. S.R.T. 9/2025"]
[null,null,"2025-03-19",71799818,31911034,39888793,47866537,13597321,"Res. S.R.T. 9/2025"]
[null,null,"2025-03-20",71799818,31911034,39888793,47866537,13597321,"Res. S.R.T. 9/2025"]
[null,null,"2025-03-21",71799818,31911034,39888793,47866537,13597321,"Res. S.R.T. 9/2025"]
[null,null,"2025-03-22",71799818,31911034,39888793,47866537,13597321,"Res. S.R.T. 9/2025"]
[null,null,"2025-03-23",71799818,31911034,39888793,47866537,13597321,"Res. S.R.T. 9/2025"]
[null,null,"2025-03-24",71799818,31911034,39888793,47866537,13597321,"Res. S.R.T. 9/2025"]
[null,null,"2025-03-25",71799818,31911034,39888793,47866537,13597321,"Res. S.R.T. 9/2025"]
[null,null,"2025-03-26",71799818,31911034,39888793,47866537,13597321,"Res. S.R.T. 9/2025"]
[null,null,"2025-03-27",71799818,31911034,39888793,47866537,13597321,"Res. S.R.T. 9/2025"]
[null,null,"2025-03-28",71799818,31911034,39888793,47866537,13597321,"Res. S.R.T. 9/2025"]
[null,null,"2025-03-29",71799818,31911034,39888793,47866537,13597321,"Res. S.R.T. 9/2025"]
[null,null,"2025-03-30",71799818,31911034,39888793,47866537,13597321,"Res. S.R.T. 9/2025"]
[null,null,"2025-03-31",71799818,31911034,39888793,47866537,13597321,"Res. S.R.T. 9/2025"]
[null,null,"2025-04-01",71799818,31911034,39888793,47866537,13597321,"Res. S.R.T. 9/2025"]
[null,null,"2025-04-02",71799818,31911034,39888793,47866537,13597321,"Res. S.R.T. 9/2025"]
[null,null,"2025-04-03",71799818,31911034,39888793,47866537,13597321,"Res. S.R.T. 9/2025"]
[null,null,"2025-04-04",71799818,31911034,39888793,47866537,13597321,"Res. S.R.T. 9/2025"]
[null,null,"2025-04-05",71799818,31911034,39888793,47866537,13597321,"Res. S.R.T. 9/2025"]
[null,null,"2025-04-06",71799818,31911034,39888793,47866537,13597321,"Res. S.R.T. 9/2025"]
[null,null,"2025-04-07",71799818,31911034,39888793,47866537,13597321,"Res. S.R.T. 9/2025"]
[null,null,"2025-04-08",71799818,31911034,39888793,47866537,13597321,"Res. S.R.T. 9/2025"]
[null,null,"2025-04-09",71799818,31911034,39888793,47866537,13597321,"Res. S.R.T. 9/2025"]
[null,null,"2025-04-10",71799818,31911034,39888793,47866537,13597321,"Res. S.R.T. 9/2025"]
[null,null,"2025-04-11",71799818,31911034,39888793,47866537,13597321,"Res. S.R.T. 9/2025"]
[null,null,"2025-04-12",71799818,31911034,39888793,47866537,13597321,"Res. S.R.T. 9/2025"]
[null,null,"2025-04-13",71799818,31911034,39888793,47866537,13597321,"Res. S.R.T. 9/2025"]
[null,null,"2025-04-14",71799818,31911034,39888793,47866537,13597321,"Res. S.R.T. 9/2025"]
[null,null,"2025-04-15",71799818,31911034,39888793,47866537,13597321,"Res. S.R.T. 9/2025"]
[null,null,"2025-04-16",71799818,31911034,39888793,47866537,13597321,"Res. S.R.T. 9/2025"]
[null,null,"2025-04-17",71799818,31911034,39888793,47866537,13597321,"Res. S.R.T. 9/2025"]
[null,null,"2025-04-18",71799818,31911034,39888793,47866537,13597321,"Res. S.R.T. 9/2025"]
[null,null,"2025-04-19",71799818,31911034,39888793,47866537,13597321,"Res. S.R.T. 9/2025"]
[null,null,"2025-04-20",71799818,31911034,39888793,47866537,13597321,"Res. S.R.T. 9/2025"]
[null,null,"2025-04-21",71799818,31911034,39888793,47866537,13597321,"Res. S.R.T. 9/2025"]
[null,null,"2025-04-22",71799818,31911034,39888793,47866537,13597321,"Res. S.R.T. 9/2025"]
[null,null,"2025-04-23",71799818,31911034,39888793,47866537,13597321,"Res. S.R.T. 9/2025"]
[null,null,"2025-04-24",71799818,31911034,39888793,47866537,13597321,"Res. S.R.T. 9/2025"]
[null,null,"2025-04-25",71799818,31911034,39888793,47866537,13597321,"Res. S.R.T. 9/2025"]
[null,null,"2025-04-26",71799818,31911034,39888793,47866537,13597321,"Res. S.R.T. 9/2025"]
[null,null,"2025-04-27",71799818,31911034,39888793,47866537,13597321,"Res. S.R.T. 9/2025"]
[null,null,"2025-04-28",71799818,31911034,39888793,47866537,13597321,"Res. S.R.T. 9/2025"]
[null,null,"2025-04-29",71799818,31911034,39888793,47866537,13597321,"Res. S.R.T. 9/2025"]
[null,null,"2025-04-30",71799818,31911034,39888793,47866537,13597321,"Res. S.R.T. 9/2025"]
[null,null,"2025-05-01",71799818,31911034,39888793,47866537,13597321,"Res. S.R.T. 9/2025"]
[null,null,"2025-05-02",71799818,31911034,39888793,47866537,13597321,"Res. S.R.T. 9/2025"]
[null,null,"2025-05-03",71799818,31911034,39888793,47866537,13597321,"Res. S.R.T. 9/2025"]
[null,null,"2025-05-04",71799818,31911034,39888793,47866537,13597321,"Res. S.R.T. 9/2025"]
[null,null,"2025-05-05",71799818,31911034,39888793,47866537,13597321,"Res. S.R.T. 9/2025"]
[null,null,"2025-05-06",71799818,31911034,39888793,47866537,13597321,"Res. S.R.T. 9/2025"]
[null,null,"2025-05-07",71799818,31911034,39888793,47866537,13597321,"Res. S.R.T. 9/2025"]
[null,null,"2025-05-08",71799818,31911034,39888793,47866537,13597321,"Res. S.R.T. 9/2025"]
[null,null,"2025-05-09",71799818,31911034,39888793,47866537,13597321,"Res. S.R.T. 9/2025"]
[null,null,"2025-05-10",71799818,31911034,39888793,47866537,13597321,"Res. S.R.T. 9/2025"]
[null,null,"2025-05-11",71799818,31911034,39888793,47866537,13597321,"Res. S.R.T. 9/2025"]
[null,null,"2025-05-12",71799818,31911034,39888793,47866537,13597321,"Res. S.R.T. 9/2025"]
[null,null,"2025-05-13",71799818,31911034,39888793,47866537,13597321,"Res. S.R.T. 9/2025"]
[null,null,"2025-05-14",71799818,31911034,39888793,47866537,13597321,"Res. S.R.T. 9/2025"]
[null,null,"2025-05-15",71799818,31911034,39888793,47866537,13597321,"Res. S.R.T. 9/2025"]
[null,null,"2025-05-16",71799818,31911034,39888793,47866537,13597321,"Res. S.R.T. 9/2025"]
[null,null,"2025-05-17",71799818,31911034,39888793,47866537,13597321,"Res. S.R.T. 9/2025"]
[null,null,"2025-05-18",71799818,31911034,39888793,47866537,13597321,"Res. S.R.T. 9/2025"]
[null,null,"2025-05-19",71799818,31911034,39888793,47866537,13597321,"Res. S.R.T. 9/2025"]
[null,null,"2025-05-20",71799818,31911034,39888793,47866537,13597321,"Res. S.R.T. 9/2025"]
[null,null,"2025-05-21",71799818,31911034,39888793,47866537,13597321,"Res. S.R.T. 9/2025"]
[null,null,"2025-05-22",71799818,31911034,39888793,47866537,13597321,"Res. S.R.T. 9/2025"]
[null,null,"2025-05-23",71799818,31911034,39888793,47866537,13597321,"Res. S.R.T. 9/2025"]
[null,null,"2025-05-24",71799818,31911034,39888793,47866537,13597321,"Res. S.R.T. 9/2025"]
[null,null,"2025-05-25",71799818,31911034,39888793,47866537,13597321,"Res. S.R.T. 9/2025"]
[null,null,"2025-05-26",71799818,31911034,39888793,47866537,13597321,"Res. S.R.T. 9/2025"]
[null,null,"2025-05-27",71799818,31911034,39888793,47866537,13597321,"Res. S.R.T. 9/2025"]
[null,null,"2025-05-28",71799818,31911034,39888793,47866537,13597321,"Res. S.R.T. 9/2025"]
[null,null,"2025-05-29",71799818,31911034,39888793,47866537,13597321,"Res. S.R.T. 9/2025"]
[null,null,"2025-05-30",71799818,31911034,39888793,47866537,13597321,"Res. S.R.T. 9/2025"]
[null,null,"2025-05-31",71799818,31911034,39888793,47866537,13597321,"Res. S.R.T. 9/2025"]
[null,null,"2025-06-01",71799818,31911034,39888793,47866537,13597321,"Res. S.R.T. 9/2025"]
[null,null,"2025-06-02",71799818,31911034,39888793,47866537,13597321,"Res. S.R.T. 9/2025"]
[null,null,"2025-06-03",71799818,31911034,39888793,47866537,13597321,"Res. S.R.T. 9/2025"]
[null,null,"2025-06-04",71799818,31911034,39888793,47866537,13597321,"Res. S.R.T. 9/2025"]
[null,null,"2025-06-05",71799818,31911034,39888793,47866537,13597321,"Res. S.R.T. 9/2025"]
[null,null,"2025-06-06",71799818,31911034,39888793,47866537,13597321,"Res. S.R.T. 9/2025"]
[null,null,"2025-06-07",71799818,31911034,39888793,47866537,13597321,"Res. S.R.T. 9/2025"]
[null,null,"2025-06-08",71799818,31911034,39888793,47866537,13597321,"Res. S.R.T. 9/2025"]
[null,null,"2025-06-09",71799818,31911034,39888793,47866537,13597321,"Res. S.R.T. 9/2025"]
[null,null,"2025-06-10",71799818,31911034,39888793,47866537,13597321,"Res. S.R.T. 9/2025"]
[null,null,"2025-06-11",71799818,31911034,39888793,47866537,13597321,"Res. S.R.T. 9/2025"]
[null,null,"2025-06-12",71799818,31911034,39888793,47866537,13597321,"Res. S.R.T. 9/2025"]
[null,null,"2025-06-13",71799818,31911034,39888793,47866537,13597321,"Res. S.R.T. 9/2025"]
[null,null,"2025-06-14",71799818,31911034,39888793,47866537,13597321,"Res. S.R.T. 9/2025"]
[null,null,"2025-06-15",71799818,31911034,39888793,47866537,13597321,"Res. S.R.T. 9/2025"]
[null,null,"2025-06-16",71799818,31911034,39888793,47866537,13597321,"Res. S.R.T. 9/2025"]
[null,null,"2025-06-17",71799818,31911034,39888793,47866537,13597321,"Res. S.R.T. 9/2025"]
[null,null,"2025-06-18",71799818,31911034,39888793,47866537,13597321,"Res. S.R.T. 9/2025"]
[null,null,"2025-06-19",71799818,31911034,39888793,47866537,13597321,"Res. S.R.T. 9/2025"]
[null,null,"2025-06-20",71799818,31911034,39888793,47866537,13597321,"Res. S.R.T. 9/2025"]
[null,null,"2025-06-21",71799818,31911034,39888793,47866537,13597321,"Res. S.R.T. 9/2025"]
[null,null,"2025-06-22",71799818,31911034,39888793,47866537,13597321,"Res. S.R.T. 9/2025"]
[null,null,"2025-06-23",71799818,31911034,39888793,47866537,13597321,"Res. S.R.T. 9/2025"]
[null,null,"2025-06-24",71799818,31911034,39888793,47866537,13597321,"Res. S.R.T. 9/2025"]
[null,null,"2025-06-25",71799818,31911034,39888793,47866537,13597321,"Res. S.R.T. 9/2025"]
[null,null,"2025-06-26",71799818,31911034,39888793,47866537,13597321,"Res. S.R.T. 9/2025"]
[null,null,"2025-06-27",71799818,31911034,39888793,47866537,13597321,"Res. S.R.T. 9/2025"]
[null,null,"2025-06-28",71799818,31911034,39888793,47866537,13597321,"Res. S.R.T. 9/2025"]
[null,null,"2025-06-29",71799818,31911034,39888793,47866537,13597321,"Res. S.R.T. 9/2025"]
[null,null,"2025-06-30",71799818,31911034,39888793,47866537,13597321,"Res. S.R.T. 9/2025"]
[null,null,"2025-07-01",71799818,31911034,39888793,47866537,13597321,"Res. S.R.T. 9/2025"]
[null,null,"2025-07-02",71799818,31911034,39888793,47866537,13597321,"Res. S.R.T. 9/2025"]
[null,null,"2025-07-03",71799818,31911034,39888793,47866537,13597321,"Res. S.R.T. 9/2025"]
[null,null,"2025-07-04",71799818,31911034,39888793,47866537,13597321,"Res. S.R.T. 9/2025"]
[null,null,"2025-07-05",71799818,31911034,39888793,47866537,13597321,"Res. S.R.T. 9/2025"]
[null,null,"2025-07-06",71799818,31911034,39888793,47866537,13597321,"Res. S.R.T. 9/2025"]
[null,null,"2025-07-07",71799818,31911034,39888793,47866537,13597321,"Res. S.R.T. 9/2025"]
[null,null,"2025-07-08",71799818,31911034,39888793,47866537,13597321,"Res. S.R.T. 9/2025"]
[null,null,"2025-07-09",71799818,31911034,39888793,47866537,13597321,"Res. S.R.T. 9/2025"]
[null,null,"2025-07-10",71799818,31911034,39888793,47866537,13597321,"Res. S.R.T. 9/2025"]
[null,null,"2025-07-11",71799818,31911034,39888793,47866537,13597321,"Res. S.R.T. 9/2025"]
[null,null,"2025-07-12",71799818,31911034,39888793,47866537,13597321,"Res. S.R.T. 9/2025"]
[null,null,"2025-07-13",71799818,31911034,39888793,47866537,13597321,"Res. S.R.T. 9/2025"]
[null,null,"2025-07-14",71799818,31911034,39888793,47866537,13597321,"Res. S.R.T. 9/2025"]
[null,null,"2025-07-15",71799818,31911034,39888793,47866537,13597321,"Res. S.R.T. 9/2025"]
[null,null,"2025-07-16",71799818,31911034,39888793,47866537,13597321,"Res. S.R.T. 9/2025"]
[null,null,"2025-07-17",71799818,31911034,39888793,47866537,13597321,"Res. S.R.T. 9/2025"]
[null,null,"2025-07-18",71799818,31911034,39888793,47866537,13597321,"Res. S.R.T. 9/2025"]
[null,null,"2025-07-19",71799818,31911034,39888793,47866537,13597321,"Res. S.R.T. 9/2025"]
[null,null,"2025-07-20",71799818,31911034,39888793,47866537,13597321,"Res. S.R.T. 9/2025"]
[null,null,"2025-07-21",71799818,31911034,39888793,47866537,13597321,"Res. S.R.T. 9/2025"]
[null,null,"2025-07-22",71799818,31911034,39888793,47866537,13597321,"Res. S.R.T. 9/2025"]
[null,null,"2025-07-23",71799818,31911034,39888793,47866537,13597321,"Res. S.R.T. 9/2025"]
[null,null,"2025-07-24",71799818,31911034,39888793,47866537,13597321,"Res. S.R.T. 9/2025"]
[null,null,"2025-07-25",71799818,31911034,39888793,47866537,13597321,"Res. S.R.T. 9/2025"]
[null,null,"2025-07-26",71799818,31911034,39888793,47866537,13597321,"Res. S.R.T. 9/2025"]
[null,null,"2025-07-27",71799818,31911034,39888793,47866537,13597321,"Res. S.R.T. 9/2025"]
[null,null,"2025-07-28",71799818,31911034,39888793,47866537,13597321,"Res. S.R.T. 9/2025"]
[null,null,"2025-07-29",71799818,31911034,39888793,47866537,13597321,"Res. S.R.T. 9/2025"]
[null,null,"2025-07-30",71799818,31911034,39888793,47866537,13597321,"Res. S.R.T. 9/2025"]
[null,null,"2025-07-31",71799818,31911034,39888793,47866537,13597321,"Res. S.R.T. 9/2025"]
[null,null,"2025-08-01",71799818,31911034,39888793,47866537,13597321,"Res. S.R.T. 9/2025"]
[null,null,"2025-08-02",71799818,31911034,39888793,47866537,13597321,"Res. S.R.T. 9/2025"]
[null,null,"2025-08-03",71799818,31911034,39888793,47866537,13597321,"Res. S.R.T. 9/2025"]
[null,null,"2025-08-04",71799818,31911034,39888793,47866537,13597321,"Res. S.R.T. 9/2025"]
[null,null,"2025-08-05",71799818,31911034,39888793,47866537,13597321,"Res. S.R.T. 9/2025"]
[null,null,"2025-08-06",71799818,31911034,39888793,47866537,13597321,"Res. S.R.T. 9/2025"]
[null,null,"2025-08-07",71799818,31911034,39888793,47866537,13597321,"Res. S.R.T. 9/2025"]
[null,null,"2025-08-08",71799818,31911034,39888793,47866537,13597321,"Res. S.R.T. 9/2025"]
[null,null,"2025-08-09",71799818,31911034,39888793,47866537,13597321,"Res. S.R.T. 9/2025"]
[null,null,"2025-08-10",71799818,31911034,39888793,47866537,13597321,"Res. S.R.T. 9/2025"]
[null,null,"2025-08-11",71799818,31911034,39888793,47866537,13597321,"Res. S.R.T. 9/2025"]
[null,null,"2025-08-12",71799818,31911034,39888793,47866537,13597321,"Res. S.R.T. 9/2025"]
[null,null,"2025-08-13",71799818,31911034,39888793,47866537,13597321,"Res. S.R.T. 9/2025"]
[null,null,"2025-08-14",71799818,31911034,39888793,47866537,13597321,"Res. S.R.T. 9/2025"]
[null,null,"2025-08-15",71799818,31911034,39888793,47866537,13597321,"Res. S.R.T. 9/2025"]
[null,null,"2025-08-16",71799818,31911034,39888793,47866537,13597321,"Res. S.R.T. 9/2025"]
[null,null,"2025-08-17",71799818,31911034,39888793,47866537,13597321,"Res. S.R.T. 9/2025"]
[null,null,"2025-08-18",71799818,31911034,39888793,47866537,13597321,"Res. S.R.T. 9/2025"]
[null,null,"2025-08-19",71799818,31911034,39888793,47866537,13597321,"Res. S.R.T. 9/2025"]
[null,null,"2025-08-20",71799818,31911034,39888793,47866537,13597321,"Res. S.R.T. 9/2025"]
[null,null,"2025-08-21",71799818,31911034,39888793,47866537,13597321,"Res. S.R.T. 9/2025"]
[null,null,"2025-08-22",71799818,31911034,39888793,47866537,13597321,"Res. S.R.T. 9/2025"]
[null,null,"2025-08-23",71799818,31911034,39888793,47866537,13597321,"Res. S.R.T. 9/2025"]
[null,null,"2025-08-24",71799818,31911034,39888793,47866537,13597321,"Res. S.R.T. 9/2025"]
[null,null,"2025-08-25",71799818,31911034,39888793,47866537,13597321,"Res. S.R.T. 9/2025"]
[null,null,"2025-08-26",71799818,31911034,39888793,47866537,13597321,"Res. S.R.T. 9/2025"]
[null,null,"2025-08-27",71799818,31911034,39888793,47866537,13597321,"Res. S.R.T. 9/2025"]
[null,null,"2025-08-28",71799818,31911034,39888793,47866537,13597321,"Res. S.R.T. 9/2025"]
[null,null,"2025-08-29",71799818,31911034,39888793,47866537,13597321,"Res. S.R.T. 9/2025"]
[null,null,"2025-08-30",71799818,31911034,39888793,47866537,13597321,"Res. S.R.T. 9/2025"]
[null,null,"2025-08-31",71799818,31911034,39888793,47866537,13597321,"Res. S.R.T. 9/2025"]
[null,null,"2025-09-01",87629423,38946415,48683019,58419605,16595103,"Res. S.R.T. 37/2025"]
[null,null,"2025-09-02",87629423,38946415,48683019,58419605,16595103,"Res. S.R.T. 37/2025"]
[null,null,"2025-09-03",87629423,38946415,48683019,58419605,16595103,"Res. S.R.T. 37/2025"]
[null,null,"2025-09-04",87629423,38946415,48683019,58419605,16595103,"Res. S.R.T. 37/2025"]
[null,null,"2025-09-05",87629423,38946415,48683019,58419605,16595103,"Res. S.R.T. 37/2025"]
[null,null,"2025-09-06",87629423,38946415,48683019,58419605,16595103,"Res. S.R.T. 37/2025"]
[null,null,"2025-09-07",87629423,38946415,48683019,58419605,16595103,"Res. S.R.T. 37/2025"]
[null,null,"2025-09-08",87629423,38946415,48683019,58419605,16595103,"Res. S.R.T. 37/2025"]
[null,null,"2025-09-09",87629423,38946415,48683019,58419605,16595103,"Res. S.R.T. 37/2025"]
[null,null,"2025-09-10",87629423,38946415,48683019,58419605,16595103,"Res. S.R.T. 37/2025"]
[null,null,"2025-09-11",87629423,38946415,48683019,58419605,16595103,"Res. S.R.T. 37/2025"]
[null,null,"2025-09-12",87629423,38946415,48683019,58419605,16595103,"Res. S.R.T. 37/2025"]
[null,null,"2025-09-13",87629423,38946415,48683019,58419605,16595103,"Res. S.R.T. 37/2025"]
[null,null,"2025-09-14",87629423,38946415,48683019,58419605,16595103,"Res. S.R.T. 37/2025"]
[null,null,"2025-09-15",87629423,38946415,48683019,58419605,16595103,"Res. S.R.T. 37/2025"]
[null,null,"2025-09-16",87629423,38946415,48683019,58419605,16595103,"Res. S.R.T. 37/2025"]
[null,null,"2025-09-17",87629423,38946415,48683019,58419605,16595103,"Res. S.R.T. 37/2025"]
[null,null,"2025-09-18",87629423,38946415,48683019,58419605,16595103,"Res. S.R.T. 37/2025"]
[null,null,"2025-09-19",87629423,38946415,48683019,58419605,16595103,"Res. S.R.T. 37/2025"]
[null,null,"2025-09-20",87629423,38946415,48683019,58419605,16595103,"Res. S.R.T. 37/2025"]
[null,null,"2025-09-21",87629423,38946415,48683019,58419605,16595103,"Res. S.R.T. 37/2025"]
[null,null,"2025-09-22",87629423,38946415,48683019,58419605,16595103,"Res. S.R.T. 37/2025"]
[null,null,"2025-09-23",87629423,38946415,48683019,58419605,16595103,"Res. S.R.T. 37/2025"]
[null,null,"2025-09-24",87629423,38946415,48683019,58419605,16595103,"Res. S.R.T. 37/2025"]
[null,null,"2025-09-25",87629423,38946415,48683019,58419605,16595103,"Res. S.R.T. 37/2025"]
[null,null,"2025-09-26",87629423,38946415,48683019,58419605,16595103,"Res. S.R.T. 37/2025"]
[null,null,"2025-09-27",87629423,38946415,48683019,58419605,16595103,"Res. S.R.T. 37/2025"]
[null,null,"2025-09-28",87629423,38946415,48683019,58419605,16595103,"Res. S.R.T. 37/2025"]
[null,null,"2025-09-29",87629423,38946415,48683019,58419605,16595103,"Res. S.R.T. 37/2025"]
[null,null,"2025-09-30",87629423,38946415,48683019,58419605,16595103,"Res. S.R.T. 37/2025"]
[null,null,"2025-10-01",87629423,38946415,48683019,58419605,16595103,"Res. S.R.T. 37/2025"]
[null,null,"2025-10-02",87629423,38946415,48683019,58419605,16595103,"Res. S.R.T. 37/2025"]
[null,null,"2025-10-03",87629423,38946415,48683019,58419605,16595103,"Res. S.R.T. 37/2025"]
[null,null,"2025-10-04",87629423,38946415,48683019,58419605,16595103,"Res. S.R.T. 37/2025"]
[null,null,"2025-10-05",87629423,38946415,48683019,58419605,16595103,"Res. S.R.T. 37/2025"]
[null,null,"2025-10-06",87629423,38946415,48683019,58419605,16595103,"Res. S.R.T. 37/2025"]
[null,null,"2025-10-07",87629423,38946415,48683019,58419605,16595103,"Res. S.R.T. 37/2025"]
[null,null,"2025-10-08",87629423,38946415,48683019,58419605,16595103,"Res. S.R.T. 37/2025"]
[null,null,"2025-10-09",87629423,38946415,48683019,58419605,16595103,"Res. S.R.T. 37/2025"]
[null,null,"2025-10-10",87629423,38946415,48683019,58419605,16595103,"Res. S.R.T. 37/2025"]
[null,null,"2025-10-11",87629423,38946415,48683019,58419605,16595103,"Res. S.R.T. 37/2025"]
[null,null,"2025-10-12",87629423,38946415,48683019,58419605,16595103,"Res. S.R.T. 37/2025"]
[null,null,"2025-10-13",87629423,38946415,48683019,58419605,16595103,"Res. S.R.T. 37/2025"]
[null,null,"2025-10-14",87629423,38946415,48683019,58419605,16595103,"Res. S.R.T. 37/2025"]
[null,null,"2025-10-15",87629423,38946415,48683019,58419605,16595103,"Res. S.R.T. 37/2025"]
[null,null,"2025-10-16",87629423,38946415,48683019,58419605,16595103,"Res. S.R.T. 37/2025"]
[null,null,"2025-10-17",87629423,38946415,48683019,58419605,16595103,"Res. S.R.T. 37/2025"]
[null,null,"2025-10-18",87629423,38946415,48683019,58419605,16595103,"Res. S.R.T. 37/2025"]
[null,null,"2025-10-19",87629423,38946415,48683019,58419605,16595103,"Res. S.R.T. 37/2025"]
[null,null,"2025-10-20",87629423,38946415,48683019,58419605,16595103,"Res. S.R.T. 37/2025"]
[null,null,"2025-10-21",87629423,38946415,48683019,58419605,16595103,"Res. S.R.T. 37/2025"]
[null,null,"2025-10-22",87629423,38946415,48683019,58419605,16595103,"Res. S.R.T. 37/2025"]
[null,null,"2025-10-23",87629423,38946415,48683019,58419605,16595103,"Res. S.R.T. 37/2025"]
[null,null,"2025-10-24",87629423,38946415,48683019,58419605,16595103,"Res. S.R.T. 37/2025"]
[null,null,"2025-10-25",87629423,38946415,48683019,58419605,16595103,"Res. S.R.T. 37/2025"]
[null,null,"2025-10-26",87629423,38946415,48683019,58419605,16595103,"Res. S.R.T. 37/2025"]
[null,null,"2025-10-27",87629423,38946415,48683019,58419605,16595103,"Res. S.R.T. 37/2025"]
[null,null,"2025-10-28",87629423,38946415,48683019,58419605,16595103,"Res. S.R.T. 37/2025"]
[null,null,"2025-10-29",87629423,38946415,48683019,58419605,16595103,"Res. S.R.T. 37/2025"]
[null,null,"2025-10-30",87629423,38946415,48683019,58419605,16595103,"Res. S.R.T. 37/2025"]
[null,null,"2025-10-31",87629423,38946415,48683019,58419605,16595103,"Res. S.R.T. 37/2025"]
[null,null,"2025-11-01",87629423,38946415,48683019,58419605,16595103,"Res. S.R.T. 37/2025"]
[null,null,"2025-11-02",87629423,38946415,48683019,58419605,16595103,"Res. S.R.T. 37/2025"]
[null,null,"2025-11-03",87629423,38946415,48683019,58419605,16595103,"Res. S.R.T. 37/2025"]
[null,null,"2025-11-04",87629423,38946415,48683019,58419605,16595103,"Res. S.R.T. 37/2025"]
[null,null,"2025-11-05",87629423,38946415,48683019,58419605,16595103,"Res. S.R.T. 37/2025"]
[null,null,"2025-11-06",87629423,38946415,48683019,58419605,16595103,"Res. S.R.T. 37/2025"]
[null,null,"2025-11-07",87629423,38946415,48683019,58419605,16595103,"Res. S.R.T. 37/2025"]
[null,null,"2025-11-08",87629423,38946415,48683019,58419605,16595103,"Res. S.R.T. 37/2025"]
[null,null,"2025-11-09",87629423,38946415,48683019,58419605,16595103,"Res. S.R.T. 37/2025"]
[null,null,"2025-11-10",87629423,38946415,48683019,58419605,16595103,"Res. S.R.T. 37/2025"]
[null,null,"2025-11-11",87629423,38946415,48683019,58419605,16595103,"Res. S.R.T. 37/2025"]
[null,null,"2025-11-12",87629423,38946415,48683019,58419605,16595103,"Res. S.R.T. 37/2025"]
[null,null,"2025-11-13",87629423,38946415,48683019,58419605,16595103,"Res. S.R.T. 37/2025"]
[null,null,"2025-11-14",87629423,38946415,48683019,58419605,16595103,"Res. S.R.T. 37/2025"]
[null,null,"2025-11-15",87629423,38946415,48683019,58419605,16595103,"Res. S.R.T. 37/2025"]
[null,null,"2025-11-16",87629423,38946415,48683019,58419605,16595103,"Res. S.R.T. 37/2025"]
[null,null,"2025-11-17",87629423,38946415,48683019,58419605,16595103,"Res. S.R.T. 37/2025"]
[null,null,"2025-11-18",87629423,38946415,48683019,58419605,16595103,"Res. S.R.T. 37/2025"]
[null,null,"2025-11-19",87629423,38946415,48683019,58419605,16595103,"Res. S.R.T. 37/2025"]
[null,null,"2025-11-20",87629423,38946415,48683019,58419605,16595103,"Res. S.R.T. 37/2025"]
[null,null,"2025-11-21",87629423,38946415,48683019,58419605,16595103,"Res. S.R.T. 37/2025"]
[null,null,"2025-11-22",87629423,38946415,48683019,58419605,16595103,"Res. S.R.T. 37/2025"]
[null,null,"2025-11-23",87629423,38946415,48683019,58419605,16595103,"Res. S.R.T. 37/2025"]
[null,null,"2025-11-24",87629423,38946415,48683019,58419605,16595103,"Res. S.R.T. 37/2025"]
[null,null,"2025-11-25",87629423,38946415,48683019,58419605,16595103,"Res. S.R.T. 37/2025"]
[null,null,"2025-11-26",87629423,38946415,48683019,58419605,16595103,"Res. S.R.T. 37/2025"]
[null,null,"2025-11-27",87629423,38946415,48683019,58419605,16595103,"Res. S.R.T. 37/2025"]
[null,null,"2025-11-28",87629423,38946415,48683019,58419605,16595103,"Res. S.R.T. 37/2025"]
[null,null,"2025-11-29",87629423,38946415,48683019,58419605,16595103,"Res. S.R.T. 37/2025"]
[null,null,"2025-11-30",87629423,38946415,48683019,58419605,16595103,"Res. S.R.T. 37/2025"]
[null,null,"2025-12-01",87629423,38946415,48683019,58419605,16595103,"Res. S.R.T. 37/2025"]
[null,null,"2025-12-02",87629423,38946415,48683019,58419605,16595103,"Res. S.R.T. 37/2025"]
[null,null,"2025-12-03",87629423,38946415,48683019,58419605,16595103,"Res. S.R.T. 37/2025"]
[null,null,"2025-12-04",87629423,38946415,48683019,58419605,16595103,"Res. S.R.T. 37/2025"]
[null,null,"2025-12-05",87629423,38946415,48683019,58419605,16595103,"Res. S.R.T. 37/2025"]
[null,null,"2025-12-06",87629423,38946415,48683019,58419605,16595103,"Res. S.R.T. 37/2025"]
[null,null,"2025-12-07",87629423,38946415,48683019,58419605,16595103,"Res. S.R.T. 37/2025"]
[null,null,"2025-12-08",87629423,38946415,48683019,58419605,16595103,"Res. S.R.T. 37/2025"]
[null,null,"2025-12-09",87629423,38946415,48683019,58419605,16595103,"Res. S.R.T. 37/2025"]
[null,null,"2025-12-10",87629423,38946415,48683019,58419605,16595103,"Res. S.R.T. 37/2025"]
[null,null,"2025-12-11",87629423,38946415,48683019,58419605,16595103,"Res. S.R.T. 37/2025"]
[null,null,"2025-12-12",87629423,38946415,48683019,58419605,16595103,"Res. S.R.T. 37/2025"]
[null,null,"2025-12-13",87629423,38946415,48683019,58419605,16595103,"Res. S.R.T. 37/2025"]
[null,null,"2025-12-14",87629423,38946415,48683019,58419605,16595103,"Res. S.R.T. 37/2025"]
[null,null,"2025-12-15",87629423,38946415,48683019,58419605,16595103,"Res. S.R.T. 37/2025"]
[null,null,"2025-12-16",87629423,38946415,48683019,58419605,16595103,"Res. S.R.T. 37/2025"]
[null,null,"2025-12-17",87629423,38946415,48683019,58419605,16595103,"Res. S.R.T. 37/2025"]
[null,null,"2025-12-18",87629423,38946415,48683019,58419605,16595103,"Res. S.R.T. 37/2025"]
[null,null,"2025-12-19",87629423,38946415,48683019,58419605,16595103,"Res. S.R.T. 37/2025"]
[null,null,"2025-12-20",87629423,38946415,48683019,58419605,16595103,"Res. S.R.T. 37/2025"]
[null,null,"2025-12-21",87629423,38946415,48683019,58419605,16595103,"Res. S.R.T. 37/2025"]
[null,null,"2025-12-22",87629423,38946415,48683019,58419605,16595103,"Res. S.R.T. 37/2025"]
[null,null,"2025-12-23",87629423,38946415,48683019,58419605,16595103,"Res. S.R.T. 37/2025"]
[null,null,"2025-12-24",87629423,38946415,48683019,58419605,16595103,"Res. S.R.T. 37/2025"]
[null,null,"2025-12-25",87629423,38946415,48683019,58419605,16595103,"Res. S.R.T. 37/2025"]
[null,null,"2025-12-26",87629423,38946415,48683019,58419605,16595103,"Res. S.R.T. 37/2025"]
[null,null,"2025-12-27",87629423,38946415,48683019,58419605,16595103,"Res. S.R.T. 37/2025"]
[null,null,"2025-12-28",87629423,38946415,48683019,58419605,16595103,"Res. S.R.T. 37/2025"]
[null,null,"2025-12-29",87629423,38946415,48683019,58419605,16595103,"Res. S.R.T. 37/2025"]
[null,null,"2025-12-30",87629423,38946415,48683019,58419605,16595103,"Res. S.R.T. 37/2025"]
[null,null,"2025-12-31",87629423,38946415,48683019,58419605,16595103,"Res. S.R.T. 37/2025"]
[null,null,"2026-01-01",87629423,38946415,48683019,58419605,16595103,"Res. S.R.T. 37/2025"]
[null,null,"2026-01-02",87629423,38946415,48683019,58419605,16595103,"Res. S.R.T. 37/2025"]
[null,null,"2026-01-03",87629423,38946415,48683019,58419605,16595103,"Res. S.R.T. 37/2025"]
[null,null,"2026-01-04",87629423,38946415,48683019,58419605,16595103,"Res. S.R.T. 37/2025"]
[null,null,"2026-01-05",87629423,38946415,48683019,58419605,16595103,"Res. S.R.T. 37/2025"]
[null,null,"2026-01-06",87629423,38946415,48683019,58419605,16595103,"Res. S.R.T. 37/2025"]
[null,null,"2026-01-07",87629423,38946415,48683019,58419605,16595103,"Res. S.R.T. 37/2025"]
[null,null,"2026-01-08",87629423,38946415,48683019,58419605,16595103,"Res. S.R.T. 37/2025"]
[null,null,"2026-01-09",87629423,38946415,48683019,58419605,16595103,"Res. S.R.T. 37/2025"]
[null,null,"2026-01-10",87629423,38946415,48683019,58419605,16595103,"Res. S.R.T. 37/2025"]
[null,null,"2026-01-11",87629423,38946415,48683019,58419605,16595103,"Res. S.R.T. 37/2025"]
[null,null,"2026-01-12",87629423,38946415,48683019,58419605,16595103,"Res. S.R.T. 37/2025"]
[null,null,"2026-01-13",87629423,38946415,48683019,58419605,16595103,"Res. S.R.T. 37/2025"]
[null,null,"2026-01-14",87629423,38946415,48683019,58419605,16595103,"Res. S.R.T. 37/2025"]
[null,null,"2026-01-15",87629423,38946415,48683019,58419605,16595103,"Res. S.R.T. 37/2025"]
[null,null,"2026-01-16",87629423,38946415,48683019,58419605,16595103,"Res. S.R.T. 37/2025"]
[null,null,"2026-01-17",87629423,38946415,48683019,58419605,16595103,"Res. S.R.T. 37/2025"]
[null,null,"2026-01-18",87629423,38946415,48683019,58419605,16595103,"Res. S.R.T. 37/2025"]
[null,null,"2026-01-19",87629423,38946415,48683019,58419605,16595103,"Res. S.R.T. 37/2025"]
[null,null,"2026-01-20",87629423,38946415,48683019,58419605,16595103,"Res. S.R.T. 37/2025"]
[null,null,"2026-01-21",87629423,38946415,48683019,58419605,16595103,"Res. S.R.T. 37/2025"]
[null,null,"2026-01-22",87629423,38946415,48683019,58419605,16595103,"Res. S.R.T. 37/2025"]
[null,null,"2026-01-23",87629423,38946415,48683019,58419605,16595103,"Res. S.R.T. 37/2025"]
[null,null,"2026-01-24",87629423,38946415,48683019,58419605,16595103,"Res. S.R.T. 37/2025"]
[null,null,"2026-01-25",87629423,38946415,48683019,58419605,16595103,"Res. S.R.T. 37/2025"]
[null,null,"2026-01-26",87629423,38946415,48683019,58419605,16595103,"Res. S.R.T. 37/2025"]
[null,null,"2026-01-27",87629423,38946415,48683019,58419605,16595103,"Res. S.R.T. 37/2025"]
[null,null,"2026-01-28",87629423,38946415,48683019,58419605,16595103,"Res. S.R.T. 37/2025"]
[null,null,"2026-01-29",87629423,38946415,48683019,58419605,16595103,"Res. S.R.T. 37/2025"]
[null,null,"2026-01-30",87629423,38946415,48683019,58419605,16595103,"Res. S.R.T. 37/2025"]
[null,null,"2026-01-31",87629423,38946415,48683019,58419605,16595103,"Res. S.R.T. 37/2025"]
[null,null,"2026-02-01",87629423,38946415,48683019,58419605,16595103,"Res. S.R.T. 37/2025"]
[null,null,"2026-02-02",87629423,38946415,48683019,58419605,16595103,"Res. S.R.T. 37/2025"]
[null,null,"2026-02-03",87629423,38946415,48683019,58419605,16595103,"Res. S.R.T. 37/2025"]
[null,null,"2026-02-04",87629423,38946415,48683019,58419605,16595103,"Res. S.R.T. 37/2025"]
[null,null,"2026-02-05",87629423,38946415,48683019,58419605,16595103,"Res. S.R.T. 37/2025"]
[null,null,"2026-02-06",87629423,38946415,48683019,58419605,16595103,"Res. S.R.T. 37/2025"]
[null,null,"2026-02-07",87629423,38946415,48683019,58419605,16595103,"Res. S.R.T. 37/2025"]
[null,null,"2026-02-08",87629423,38946415,48683019,58419605,16595103,"Res. S.R.T. 37/2025"]
[null,null,"2026-02-09",87629423,38946415,48683019,58419605,16595103,"Res. S.R.T. 37/2025"]
[null,null,"2026-02-10",87629423,38946415,48683019,58419605,16595103,"Res. S.R.T. 37/2025"]
[null,null,"2026-02-11",87629423,38946415,48683019,58419605,16595103,"Res. S.R.T. 37/2025"]
[null,null,"2026-02-12",87629423,38946415,48683019,58419605,16595103,"Res. S.R.T. 37/2025"]
[null,null,"2026-02-13",87629423,38946415,48683019,58419605,16595103,"Res. S.R.T. 37/2025"]
[null,null,"2026-02-14",87629423,38946415,48683019,58419605,16595103,"Res. S.R.T. 37/2025"]
[null,null,"2026-02-15",87629423,38946415,48683019,58419605,16595103,"Res. S.R.T. 37/2025"]
[null,null,"2026-02-16",87629423,38946415,48683019,58419605,16595103,"Res. S.R.T. 37/2025"]
[null,null,"2026-02-17",87629423,38946415,48683019,58419605,16595103,"Res. S.R.T. 37/2025"]
[null,null,"2026-02-18",87629423,38946415,48683019,58419605,16595103,"Res. S.R.T. 37/2025"]
[null,null,"2026-02-19",87629423,38946415,48683019,58419605,16595103,"Res. S.R.T. 37/2025"]
[null,null,"2026-02-20",87629423,38946415,48683019,58419605,16595103,"Res. S.R.T. 37/2025"]
[null,null,"2026-02-21",87629423,38946415,48683019,58419605,16595103,"Res. S.R.T. 37/2025"]
[null,null,"2026-02-22",87629423,38946415,48683019,58419605,16595103,"Res. S.R.T. 37/2025"]
[null,null,"2026-02-23",87629423,38946415,48683019,58419605,16595103,"Res. S.R.T. 37/2025"]
[null,null,"2026-02-24",87629423,38946415,48683019,58419605,16595103,"Res. S.R.T. 37/2025"]
[null,null,"2026-02-25",87629423,38946415,48683019,58419605,16595103,"Res. S.R.T. 37/2025"]
[null,null,"2026-02-26",87629423,38946415,48683019,58419605,16595103,"Res. S.R.T. 37/2025"]
[null,null,"2026-02-27",87629423,38946415,48683019,58419605,16595103,"Res. S.R.T. 37/2025"]
[null,null,"2026-02-28",87629423,38946415,48683019,58419605,16595103,"Res. S.R.T. 37/2025"]
[null,null,"2026-03-01",97502420,43334414,54168018,65001602,18464833,"Res. S.R.T. 15/2026"]
[null,null,"2026-03-02",97502420,43334414,54168018,65001602,18464833,"Res. S.R.T. 15/2026"]
[null,null,"2026-03-03",97502420,43334414,54168018,65001602,18464833,"Res. S.R.T. 15/2026"]
[null,null,"2026-03-04",97502420,43334414,54168018,65001602,18464833,"Res. S.R.T. 15/2026"]
[null,null,"2026-03-05",97502420,43334414,54168018,65001602,18464833,"Res. S.R.T. 15/2026"]
[null,null,"2026-03-06",97502420,43334414,54168018,65001602,18464833,"Res. S.R.T. 15/2026"]
[null,null,"2026-03-07",97502420,43334414,54168018,65001602,18464833,"Res. S.R.T. 15/2026"]
[null,null,"2026-03-08",97502420,43334414,54168018,65001602,18464833,"Res. S.R.T. 15/2026"]
[null,null,"2026-03-09",97502420,43334414,54168018,65001602,18464833,"Res. S.R.T. 15/2026"]
[null,null,"2026-03-10",97502420,43334414,54168018,65001602,18464833,"Res. S.R.T. 15/2026"]
[null,null,"2026-03-11",97502420,43334414,54168018,65001602,18464833,"Res. S.R.T. 15/2026"]
[null,null,"2026-03-12",97502420,43334414,54168018,65001602,18464833,"Res. S.R.T. 15/2026"]
[null,null,"2026-03-13",97502420,43334414,54168018,65001602,18464833,"Res. S.R.T. 15/2026"]
[null,null,"2026-03-14",97502420,43334414,54168018,65001602,18464833,"Res. S.R.T. 15/2026"]
[null,null,"2026-03-15",97502420,43334414,54168018,65001602,18464833,"Res. S.R.T. 15/2026"]
[null,null,"2026-03-16",97502420,43334414,54168018,65001602,18464833,"Res. S.R.T. 15/2026"]
[null,null,"2026-03-17",97502420,43334414,54168018,65001602,18464833,"Res. S.R.T. 15/2026"]
[null,null,"2026-03-18",97502420,43334414,54168018,65001602,18464833,"Res. S.R.T. 15/2026"]
[null,null,"2026-03-19",97502420,43334414,54168018,65001602,18464833,"Res. S.R.T. 15/2026"]
[null,null,"2026-03-20",97502420,43334414,54168018,65001602,18464833,"Res. S.R.T. 15/2026"]
[null,null,"2026-03-21",97502420,43334414,54168018,65001602,18464833,"Res. S.R.T. 15/2026"]
[null,null,"2026-03-22",97502420,43334414,54168018,65001602,18464833,"Res. S.R.T. 15/2026"]
[null,null,"2026-03-23",97502420,43334414,54168018,65001602,18464833,"Res. S.R.T. 15/2026"]
[null,null,"2026-03-24",97502420,43334414,54168018,65001602,18464833,"Res. S.R.T. 15/2026"]
[null,null,"2026-03-25",97502420,43334414,54168018,65001602,18464833,"Res. S.R.T. 15/2026"]
[null,null,"2026-03-26",97502420,43334414,54168018,65001602,18464833,"Res. S.R.T. 15/2026"]
[null,null,"2026-03-27",97502420,43334414,54168018,65001602,18464833,"Res. S.R.T. 15/2026"]
[null,null,"2026-03-28",97502420,43334414,54168018,65001602,18464833,"Res. S.R.T. 15/2026"]
[null,null,"2026-03-29",97502420,43334414,54168018,65001602,18464833,"Res. S.R.T. 15/2026"]
[null,null,"2026-03-30",97502420,43334414,54168018,65001602,18464833,"Res. S.R.T. 15/2026"]
[null,null,"2026-03-31",97502420,43334414,54168018,65001602,18464833,"Res. S.R.T. 15/2026"]
[null,null,"2026-04-01",97502420,43334414,54168018,65001602,18464833,"Res. S.R.T. 15/2026"]
[null,null,"2026-04-02",97502420,43334414,54168018,65001602,18464833,"Res. S.R.T. 15/2026"]
[null,null,"2026-04-03",97502420,43334414,54168018,65001602,18464833,"Res. S.R.T. 15/2026"]
[null,null,"2026-04-04",97502420,43334414,54168018,65001602,18464833,"Res. S.R.T. 15/2026"]
[null,null,"2026-04-05",97502420,43334414,54168018,65001602,18464833,"Res. S.R.T. 15/2026"]
[null,null,"2026-04-06",97502420,43334414,54168018,65001602,18464833,"Res. S.R.T. 15/2026"]
[null,null,"2026-04-07",97502420,43334414,54168018,65001602,18464833,"Res. S.R.T. 15/2026"]
[null,null,"2026-04-08",97502420,43334414,54168018,65001602,18464833,"Res. S.R.T. 15/2026"]
[null,null,"2026-04-09",97502420,43334414,54168018,65001602,18464833,"Res. S.R.T. 15/2026"]
[null,null,"2026-04-10",97502420,43334414,54168018,65001602,18464833,"Res. S.R.T. 15/2026"]
[null,null,"2026-04-11",97502420,43334414,54168018,65001602,18464833,"Res. S.R.T. 15/2026"]
[null,null,"2026-04-12",97502420,43334414,54168018,65001602,18464833,"Res. S.R.T. 15/2026"]
[null,null,"2026-04-13",97502420,43334414,54168018,65001602,18464833,"Res. S.R.T. 15/2026"]
[null,null,"2026-04-14",97502420,43334414,54168018,65001602,18464833,"Res. S.R.T. 15/2026"]
[null,null,"2026-04-15",97502420,43334414,54168018,65001602,18464833,"Res. S.R.T. 15/2026"]
[null,null,"2026-04-16",97502420,43334414,54168018,65001602,18464833,"Res. S.R.T. 15/2026"]
[null,null,"2026-04-17",97502420,43334414,54168018,65001602,18464833,"Res. S.R.T. 15/2026"]
[null,null,"2026-04-18",97502420,43334414,54168018,65001602,18464833,"Res. S.R.T. 15/2026"]
[null,null,"2026-04-19",97502420,43334414,54168018,65001602,18464833,"Res. S.R.T. 15/2026"]
[null,null,"2026-04-20",97502420,43334414,54168018,65001602,18464833,"Res. S.R.T. 15/2026"]
[null,null,"2026-04-21",97502420,43334414,54168018,65001602,18464833,"Res. S.R.T. 15/2026"]
[null,null,"2026-04-22",97502420,43334414,54168018,65001602,18464833,"Res. S.R.T. 15/2026"]
[null,null,"2026-04-23",97502420,43334414,54168018,65001602,18464833,"Res. S.R.T. 15/2026"]
[null,null,"2026-04-24",97502420,43334414,54168018,65001602,18464833,"Res. S.R.T. 15/2026"]
[null,null,"2026-04-25",97502420,43334414,54168018,65001602,18464833,"Res. S.R.T. 15/2026"]
[null,null,"2026-04-26",97502420,43334414,54168018,65001602,18464833,"Res. S.R.T. 15/2026"]
[null,null,"2026-04-27",97502420,43334414,54168018,65001602,18464833,"Res. S.R.T. 15/2026"]
[null,null,"2026-04-28",97502420,43334414,54168018,65001602,18464833,"Res. S.R.T. 15/2026"]
[null,null,"2026-04-29",97502420,43334414,54168018,65001602,18464833,"Res. S.R.T. 15/2026"]
[null,null,"2026-04-30",97502420,43334414,54168018,65001602,18464833,"Res. S.R.T. 15/2026"]
[null,null,"2026-05-01",97502420,43334414,54168018,65001602,18464833,"Res. S.R.T. 15/2026"]
[null,null,"2026-05-02",97502420,43334414,54168018,65001602,18464833,"Res. S.R.T. 15/2026"]
[null,null,"2026-05-03",97502420,43334414,54168018,65001602,18464833,"Res. S.R.T. 15/2026"]
[null,null,"2026-05-04",97502420,43334414,54168018,65001602,18464833,"Res. S.R.T. 15/2026"]
[null,null,"2026-05-05",97502420,43334414,54168018,65001602,18464833,"Res. S.R.T. 15/2026"]
[null,null,"2026-05-06",97502420,43334414,54168018,65001602,18464833,"Res. S.R.T. 15/2026"]
[null,null,"2026-05-07",97502420,43334414,54168018,65001602,18464833,"Res. S.R.T. 15/2026"]
[null,null,"2026-05-08",97502420,43334414,54168018,65001602,18464833,"Res. S.R.T. 15/2026"]
[null,null,"2026-05-09",97502420,43334414,54168018,65001602,18464833,"Res. S.R.T. 15/2026"]
[null,null,"2026-05-10",97502420,43334414,54168018,65001602,18464833,"Res. S.R.T. 15/2026"]
[null,null,"2026-05-11",97502420,43334414,54168018,65001602,18464833,"Res. S.R.T. 15/2026"]
[null,null,"2026-05-12",97502420,43334414,54168018,65001602,18464833,"Res. S.R.T. 15/2026"]
[null,null,"2026-05-13",97502420,43334414,54168018,65001602,18464833,"Res. S.R.T. 15/2026"]
[null,null,"2026-05-14",97502420,43334414,54168018,65001602,18464833,"Res. S.R.T. 15/2026"]
[null,null,"2026-05-15",97502420,43334414,54168018,65001602,18464833,"Res. S.R.T. 15/2026"]
[null,null,"2026-05-16",97502420,43334414,54168018,65001602,18464833,"Res. S.R.T. 15/2026"]
[null,null,"2026-05-17",97502420,43334414,54168018,65001602,18464833,"Res. S.R.T. 15/2026"]
[null,null,"2026-05-18",97502420,43334414,54168018,65001602,18464833,"Res. S.R.T. 15/2026"]
[null,null,"2026-05-19",97502420,43334414,54168018,65001602,18464833,"Res. S.R.T. 15/2026"]
[null,null,"2026-05-20",97502420,43334414,54168018,65001602,18464833,"Res. S.R.T. 15/2026"]
[null,null,"2026-05-21",97502420,43334414,54168018,65001602,18464833,"Res. S.R.T. 15/2026"]
[null,null,"2026-05-22",97502420,43334414,54168018,65001602,18464833,"Res. S.R.T. 15/2026"]
[null,null,"2026-05-23",97502420,43334414,54168018,65001602,18464833,"Res. S.R.T. 15/2026"]
[null,null,"2026-05-24",97502420,43334414,54168018,65001602,18464833,"Res. S.R.T. 15/2026"]
[null,null,"2026-05-25",97502420,43334414,54168018,65001602,18464833,"Res. S.R.T. 15/2026"]
[null,null,"2026-05-26",97502420,43334414,54168018,65001602,18464833,"Res. S.R.T. 15/2026"]
[null,null,"2026-05-27",97502420,43334414,54168018,65001602,18464833,"Res. S.R.T. 15/2026"]
[null,null,"2026-05-28",97502420,43334414,54168018,65001602,18464833,"Res. S.R.T. 15/2026"]
[null,null,"2026-05-29",97502420,43334414,54168018,65001602,18464833,"Res. S.R.T. 15/2026"]
[null,null,"2026-05-30",97502420,43334414,54168018,65001602,18464833,"Res. S.R.T. 15/2026"]
[null,null,"2026-05-31",97502420,43334414,54168018,65001602,18464833,"Res. S.R.T. 15/2026"]
[null,null,"2026-06-01",97502420,43334414,54168018,65001602,18464833,"Res. S.R.T. 15/2026"]
[null,null,"2026-06-02",97502420,43334414,54168018,65001602,18464833,"Res. S.R.T. 15/2026"]
[null,null,"2026-06-03",97502420,43334414,54168018,65001602,18464833,"Res. S.R.T. 15/2026"]
[null,null,"2026-06-04",97502420,43334414,54168018,65001602,18464833,"Res. S.R.T. 15/2026"]
[null,null,"2026-06-05",97502420,43334414,54168018,65001602,18464833,"Res. S.R.T. 15/2026"]
[null,null,"2026-06-06",97502420,43334414,54168018,65001602,18464833,"Res. S.R.T. 15/2026"]
[null,null,"2026-06-07",97502420,43334414,54168018,65001602,18464833,"Res. S.R.T. 15/2026"]
[null,null,"2026-06-08",97502420,43334414,54168018,65001602,18464833,"Res. S.R.T. 15/2026"]
[null,null,"2026-06-09",97502420,43334414,54168018,65001602,18464833,"Res. S.R.T. 15/2026"]
[null,null,"2026-06-10",97502420,43334414,54168018,65001602,18464833,"Res. S.R.T. 15/2026"]
[null,null,"2026-06-11",97502420,43334414,54168018,65001602,18464833,"Res. S.R.T. 15/2026"]
[null,null,"2026-06-12",97502420,43334414,54168018,65001602,18464833,"Res. S.R.T. 15/2026"]
[null,null,"2026-06-13",97502420,43334414,54168018,65001602,18464833,"Res. S.R.T. 15/2026"]
[null,null,"2026-06-14",97502420,43334414,54168018,65001602,18464833,"Res. S.R.T. 15/2026"]
[null,null,"2026-06-15",97502420,43334414,54168018,65001602,18464833,"Res. S.R.T. 15/2026"]
[null,null,"2026-06-16",97502420,43334414,54168018,65001602,18464833,"Res. S.R.T. 15/2026"]
[null,null,"2026-06-17",97502420,43334414,54168018,65001602,18464833,"Res. S.R.T. 15/2026"]
[null,null,"2026-06-18",97502420,43334414,54168018,65001602,18464833,"Res. S.R.T. 15/2026"]
[null,null,"2026-06-19",97502420,43334414,54168018,65001602,18464833,"Res. S.R.T. 15/2026"]
[null,null,"2026-06-20",97502420,43334414,54168018,65001602,18464833,"Res. S.R.T. 15/2026"]
[null,null,"2026-06-21",97502420,43334414,54168018,65001602,18464833,"Res. S.R.T. 15/2026"]
[null,null,"2026-06-22",97502420,43334414,54168018,65001602,18464833,"Res. S.R.T. 15/2026"]
[null,null,"2026-06-23",97502420,43334414,54168018,65001602,18464833,"Res. S.R.T. 15/2026"]
[null,null,"2026-06-24",97502420,43334414,54168018,65001602,18464833,"Res. S.R.T. 15/2026"]
[null,null,"2026-06-25",97502420,43334414,54168018,65001602,18464833,"Res. S.R.T. 15/2026"]
[null,null,"2026-06-26",97502420,43334414,54168018,65001602,18464833,"Res. S.R.T. 15/2026"]
[null,null,"2026-06-27",97502420,43334414,54168018,65001602,18464833,"Res. S.R.T. 15/2026"]
[null,null,"2026-06-28",97502420,43334414,54168018,65001602,18464833,"Res. S.R.T. 15/2026"]
[null,null,"2026-06-29",97502420,43334414,54168018,65001602,18464833,"Res. S.R.T. 15/2026"]
[null,null,"2026-06-30",97502420,43334414,54168018,65001602,18464833,"Res. S.R.T. 15/2026"]
[null,null,"2026-07-01",97502420,43334414,54168018,65001602,18464833,"Res. S.R.T. 15/2026"]
[null,null,"2026-07-02",97502420,43334414,54168018,65001602,18464833,"Res. S.R.T. 15/2026"]
[null,null,"2026-07-03",97502420,43334414,54168018,65001602,18464833,"Res. S.R.T. 15/2026"]
[null,null,"2026-07-04",97502420,43334414,54168018,65001602,18464833,"Res. S.R.T. 15/2026"]
[null,null,"2026-07-05",97502420,43334414,54168018,65001602,18464833,"Res. S.R.T. 15/2026"]
[null,null,"2026-07-06",97502420,43334414,54168018,65001602,18464833,"Res. S.R.T. 15/2026"]
[null,null,"2026-07-07",97502420,43334414,54168018,65001602,18464833,"Res. S.R.T. 15/2026"]
[null,null,"2026-07-08",97502420,43334414,54168018,65001602,18464833,"Res. S.R.T. 15/2026"]
[null,null,"2026-07-09",97502420,43334414,54168018,65001602,18464833,"Res. S.R.T. 15/2026"]
[null,null,"2026-07-10",97502420,43334414,54168018,65001602,18464833,"Res. S.R.T. 15/2026"]
[null,null,"2026-07-11",97502420,43334414,54168018,65001602,18464833,"Res. S.R.T. 15/2026"]
[null,null,"2026-07-12",97502420,43334414,54168018,65001602,18464833,"Res. S.R.T. 15/2026"]
[null,null,"2026-07-13",97502420,43334414,54168018,65001602,18464833,"Res. S.R.T. 15/2026"]
[null,null,"2026-07-14",97502420,43334414,54168018,65001602,18464833,"Res. S.R.T. 15/2026"]
[null,null,"2026-07-15",97502420,43334414,54168018,65001602,18464833,"Res. S.R.T. 15/2026"]
[null,null,"2026-07-16",97502420,43334414,54168018,65001602,18464833,"Res. S.R.T. 15/2026"]
[null,null,"2026-07-17",97502420,43334414,54168018,65001602,18464833,"Res. S.R.T. 15/2026"]
[null,null,"2026-07-18",97502420,43334414,54168018,65001602,18464833,"Res. S.R.T. 15/2026"]
[null,null,"2026-07-19",97502420,43334414,54168018,65001602,18464833,"Res. S.R.T. 15/2026"]
[null,null,"2026-07-20",97502420,43334414,54168018,65001602,18464833,"Res. S.R.T. 15/2026"]
[null,null,"2026-07-21",97502420,43334414,54168018,65001602,18464833,"Res. S.R.T. 15/2026"]
[null,null,"2026-07-22",97502420,43334414,54168018,65001602,18464833,"Res. S.R.T. 15/2026"]
[null,null,"2026-07-23",97502420,43334414,54168018,65001602,18464833,"Res. S.R.T. 15/2026"]
[null,null,"2026-07-24",97502420,43334414,54168018,65001602,18464833,"Res. S.R.T. 15/2026"]
[null,null,"2026-07-25",97502420,43334414,54168018,65001602,18464833,"Res. S.R.T. 15/2026"]
[null,null,"2026-07-26",97502420,43334414,54168018,65001602,18464833,"Res. S.R.T. 15/2026"]
[null,null,"2026-07-27",97502420,43334414,54168018,65001602,18464833,"Res. S.R.T. 15/2026"]
[null,null,"2026-07-28",97502420,43334414,54168018,65001602,18464833,"Res. S.R.T. 15/2026"]
[null,null,"2026-07-29",97502420,43334414,54168018,65001602,18464833,"Res. S.R.T. 15/2026"]
[null,null,"2026-07-30",97502420,43334414,54168018,65001602,18464833,"Res. S.R.T. 15/2026"]
[null,null,"2026-07-31",97502420,43334414,54168018,65001602,18464833,"Res. S.R.T. 15/2026"]
[null,null,"2026-08-01",97502420,43334414,54168018,65001602,18464833,"Res. S.R.T. 15/2026"]
[null,null,"2026-08-02",97502420,43334414,54168018,65001602,18464833,"Res. S.R.T. 15/2026"]
[null,null,"2026-08-03",97502420,43334414,54168018,65001602,18464833,"Res. S.R.T. 15/2026"]
[null,null,"2026-08-04",97502420,43334414,54168018,65001602,18464833,"Res. S.R.T. 15/2026"]
[null,null,"2026-08-05",97502420,43334414,54168018,65001602,18464833,"Res. S.R.T. 15/2026"]
[null,null,"2026-08-06",97502420,43334414,54168018,65001602,18464833,"Res. S.R.T. 15/2026"]
[null,null,"2026-08-07",97502420,43334414,54168018,65001602,18464833,"Res. S.R.T. 15/2026"]
[null,null,"2026-08-08",97502420,43334414,54168018,65001602,18464833,"Res. S.R.T. 15/2026"]
[null,null,"2026-08-09",97502420,43334414,54168018,65001602,18464833,"Res. S.R.T. 15/2026"]
[null,null,"2026-08-10",97502420,43334414,54168018,65001602,18464833,"Res. S.R.T. 15/2026"]
[null,null,"2026-08-11",97502420,43334414,54168018,65001602,18464833,"Res. S.R.T. 15/2026"]
[null,null,"2026-08-12",97502420,43334414,54168018,65001602,18464833,"Res. S.R.T. 15/2026"]
[null,null,"2026-08-13",97502420,43334414,54168018,65001602,18464833,"Res. S.R.T. 15/2026"]
[null,null,"2026-08-14",97502420,43334414,54168018,65001602,18464833,"Res. S.R.T. 15/2026"]
[null,null,"2026-08-15",97502420,43334414,54168018,65001602,18464833,"Res. S.R.T. 15/2026"]
[null,null,"2026-08-16",97502420,43334414,54168018,65001602,18464833,"Res. S.R.T. 15/2026"]
[null,null,"2026-08-17",97502420,43334414,54168018,65001602,18464833,"Res. S.R.T. 15/2026"]
[null,null,"2026-08-18",97502420,43334414,54168018,65001602,18464833,"Res. S.R.T. 15/2026"]
[null,null,"2026-08-19",97502420,43334414,54168018,65001602,18464833,"Res. S.R.T. 15/2026"]
[null,null,"2026-08-20",97502420,43334414,54168018,65001602,18464833,"Res. S.R.T. 15/2026"]
[null,null,"2026-08-21",97502420,43334414,54168018,65001602,18464833,"Res. S.R.T. 15/2026"]
[null,null,"2026-08-22",97502420,43334414,54168018,65001602,18464833,"Res. S.R.T. 15/2026"]
[null,null,"2026-08-23",97502420,43334414,54168018,65001602,18464833,"Res. S.R.T. 15/2026"]
[null,null,"2026-08-24",97502420,43334414,54168018,65001602,18464833,"Res. S.R.T. 15/2026"]
[null,null,"2026-08-25",97502420,43334414,54168018,65001602,18464833,"Res. S.R.T. 15/2026"]
[null,null,"2026-08-26",97502420,43334414,54168018,65001602,18464833,"Res. S.R.T. 15/2026"]
[null,null,"2026-08-27",97502420,43334414,54168018,65001602,18464833,"Res. S.R.T. 15/2026"]
[null,null,"2026-08-28",97502420,43334414,54168018,65001602,18464833,"Res. S.R.T. 15/2026"]
[null,null,"2026-08-29",97502420,43334414,54168018,65001602,18464833,"Res. S.R.T. 15/2026"]
[null,null,"2026-08-30",97502420,43334414,54168018,65001602,18464833,"Res. S.R.T. 15/2026"]
[null,null,"2026-08-31",97502420,43334414,54168018,65001602,18464833,"Res. S.R.T. 15/2026"]

{"sheet":"Índice RIPTE","index":2,"n_rows":133,"n_cols":9,"rows_kept":133,"cut":false,"hidden":false,"merged":[]}
[null,"Mes Haberes","Mes Haberes","Mes Haberes","Índice \nRIPTE",null,null,"Fuente:","https://www.argentina.gob.ar/trabajo/seguridadsocial/ripte"]
[null,null,null,"2016-01-01",1808.6]
[null,null,null,"2016-02-01",1888.34]
[null,null,null,"2016-03-01",1940.55]
[null,null,null,"2016-04-01",2022.16]
[null,null,null,"2016-05-01",2062.33]
[null,null,null,"2016-06-01",2089.1799999999998]
[null,null,null,"2016-07-01",2170.4299999999998]
[null,null,null,"2016-08-01",2196.5300000000002]
[null,null,null,"2016-09-01",2247.9299999999998]
[null,null,null,"2016-10-01",2293.9699999999998]
[null,null,null,"2016-11-01",2334.36]
[null,null,null,"2016-12-01",2364.94]
[null,null,null,"2017-01-01",2405.87]
[null,null,null,"2017-02-01",2455.5700000000002]
[null,null,null,"2017-03-01",2547.29]
[null,null,null,"2017-04-01",2589.02]
[null,null,null,"2017-05-01",2632.39]
[null,null,null,"2017-06-01",2682.68]
[null,null,null,"2017-07-01",2799.18]
[null,null,null,"2017-08-01",2823.33]
[null,null,null,"2017-09-01",2873.15]
[null,null,null,"2017-10-01",2953.98]
[null,null,null,"2017-11-01",2992.14]
[null,null,null,"2017-12-01",3006.32]
[null,null,null,"2018-01-01",3078.15]
[null,null,null,"2018-02-01",3136.49]
[null,null,null,"2018-03-01",3208.74]
[null,null,null,"2018-04-01",3298.55]
[null,null,null,"2018-05-01",3353.5]
[null,null,null,"2018-06-01",3383.14]
[null,null,null,"2018-07-01",3461.52]
[null,null,null,"2018-08-01",3540.95]
[null,null,null,"2018-09-01",3603.23]
[null,null,null,"2018-10-01",3789.62]
[null,null,null,"2018-11-01",3855.86]
[null,null,null,"2018-12-01",3925.11]
[null,null,null,"2019-01-01",4042]
[null,null,null,"2019-02-01",4198.76]
[null,null,null,"2019-03-01",4444.6000000000004]
[null,null,null,"2019-04-01",4533.03]
[null,null,null,"2019-05-01",4676.25]
[null,null,null,"2019-06-01",4753.1899999999996]
[null,null,null,"2019-07-01",4948.2700000000004]
[null,null,null,"2019-08-01",5039.93]
[null,null,null,"2019-09-01",5199.08]
[null,null,null,"2019-10-01",5467.59]
[null,null,null,"2019-11-01",5554.15]
[null,null,null,"2019-12-01",5666.48]
[null,null,null,"2020-01-01",6066.07]
[null,null,null,"2020-02-01",6445.13]
[null,null,null,"2020-03-01",6500.72]
[null,null,null,"2020-04-01",6510.18]
[null,null,null,"2020-05-01",6521.87]
[null,null,null,"2020-06-01",6670.93]
[null,null,null,"2020-07-01",6908.52]
[null,null,null,"2020-08-01",6945.86]
[null,null,null,"2020-09-01",7076.47]
[null,null,null,"2020-10-01",7401.81]
[null,null,null,"2020-11-01",7495.03]
[null,null,null,"2020-12-01",7643.41]
[null,null,null,"2021-01-01",7784.1]
[null,null,null,"2021-02-01",8263.33]
[null,null,null,"2021-03-01",8665.19]
[null,null,null,"2021-04-01",9201.59]
[null,null,null,"2021-05-01",9311.61]
[null,null,null,"2021-06-01",9660.1299999999992]
[null,null,null,"2021-07-01",10089.959999999999]
[null,null,null,"2021-08-01",10326.11]
[null,null,null,"2021-09-01",10762.48]
[null,null,null,"2021-10-01",11148.95]
[null,null,null,"2021-11-01",11497.72]
[null,null,null,"2021-12-01",11726.3]
[null,null,null,"2022-01-01",12271.35]
[null,null,null,"2022-02-01",12849.2]
[null,null,null,"2022-03-01",13855.82]
[null,null,null,"2022-04-01",14677.19]
[null,null,null,"2022-05-01",15270.36]
[null,null,null,"2022-06-01",16149.76]
[null,null,null,"2022-07-01",17009.599999999999]
[null,null,null,"2022-08-01",17786.79]
[null,null,null,"2022-09-01",18908.07]
[null,null,null,"2022-10-01",19938.61]
[null,null,null,"2022-11-01",21055.73]
[null,null,null,"2022-12-01",22194.74]
[null,null,null,"2023-01-01",23041.17]
[null,null,null,"2023-02-01",24980.16]
[null,null,null,"2023-03-01",27419.24]
[null,null,null,"2023-04-01",30116.61]
[null,null,null,"2023-05-01",31984.22]
[null,null,null,"2023-06-01",34583.730000000003]
[null,null,null,"2023-07-01",37148.07]
[null,null,null,"2023-08-01",39326.69]
[null,null,null,"2023-09-01",43045.75]
[null,"2024-01-01",null,"2023-10-01",48087.89]
[null,"2024-02-01",null,"2023-11-01",51102.400000000001]
[null,"2024-03-01",null,"2023-12-01",55356.61]
[null,"2024-04-01","2024-01-01","ene-24",63468.76]
[null,"2024-05-01","2024-02-01","feb-24",70754.17]
[null,"2024-06-01","2024-03-01","mar-24",80678.570000000007]
[null,"2024-07-01","2024-04-01","abr-24",93671.26]
[null,"2024-08-01","2024-05-01","may-24",100527.29]
[null,"2024-09-01","2024-06-01","jun-24",106664.97]
[null,"2024-10-01","2024-07-01","jul-24",113694.76]
[null,"2024-11-01","2024-08-01","ago-24",118007.3]
[null,"2024-12-01","2024-09-01","sep-24",122891.98]
[null,"2025-01-01","2024-10-01","oct-24",131045.09]
[null,"2025-02-01","2024-11-01","nov-24",134754.34]
[null,"2025-03-01","2024-12-01","dic-24",137497.9]
[null,"2025-04-01","2025-01-01","ene-25",141124.78]
[null,"2025-05-01","2025-02-01","feb-25",149777.43]
[null,"2025-06-01","2025-03-01","mar-25",155852.91]
[null,"2025-07-01","2025-04-01","abr-25",160321.72]
[null,"2025-08-01","2025-05-01","may-25",163299.84]
[null,"2025-09-01","2025-06-01","jun-25",167811.87]
[null,"2025-10-01","2025-07-01","jul-25",172674.89]
[null,"2025-11-01","2025-08-01","ago-25",174917.11]
[null,"2025-12-01","2025-09-01","sep-25",177378.55]
[null,"2026-01-01","2025-10-01","oct-25",182089.61]
[null,"2026-02-01","2025-11-01","nov-25",184238.99]
[null,"2026-03-01","2025-12-01","dic-25",186718.83]
[null,"2026-04-01","2026-01-01","ene-26",188181.62]
[null,"2026-05-01","2026-02-01"]
[null,"2026-06-01","2026-03-01"]
[null,"2026-07-01","2026-04-01"]
[null,"2026-08-01","2026-05-01"]
[null,"2026-09-01","2026-06-01"]
[null,"2026-10-01","2026-07-01"]
[null,"2026-11-01","2026-08-01"]
[null,"2026-12-01","2026-09-01"]
[null,"2027-01-01","2026-10-01"]
[null,"2027-02-01","2026-11-01"]
[null,"2027-03-01","2026-12-01"]